{"text_format":"1","workbook":"xlsx","n_sheets":5,"sheets":["Kugeln","Ergebnismenge","Ergebnis-W.","Ereignis-W. (1)","Ereignis-W. (2)"],"not_rendered":{"charts":0,"images":0,"macros":1,"external_links":0,"defined_names":0,"comments":0,"pivot_tables":0},"unopened":[],"bounds":{"document_bytes":16777216,"sheet_cells":100000,"rows_first":2000,"rows_last":500,"rows_between":2000,"halvings":0,"cell_chars":16384,"cell_head_chars":4096},"cells_cut":0,"cells_raw":0,"read":"whole","date_system":"1900"}

{"sheet":"Kugeln","index":0,"n_rows":113,"n_cols":37,"rows_kept":113,"cut":false,"hidden":false,"merged":[[3,1,4,3],[10,1,11,2],[15,32,21,42],[62,15,62,18],[62,20,62,22],[23,36,24,37]]}
[null,null,null,null,null,null,null,null,null,null,null,null,null,null,null,null,null,null,null,null,null,null,null,null,null,null,null,null,null,null,true]
[null,"Anzahl der Kugeln",null,null,null,null,null,49]
[null,null,null,null,null,null,null,null,null,null,null,null,null,null,null,null,null,null,null,null,null,null,null,null,"Aufschrift","Farbe"]
[null,"entweder",null,null,null,null,null,null,null,null,null,null,null,null,null,null,null,null,null,null,null,null,null,{"$f":"CONCATENATE(\"(\",Y4,\", \",Z4,\")\")","v":"(7, grün)"},7,"grün",null,{"$f":"IF(J65<=$H$2,IF($H$14=TRUE,Q65,IF(AND($H$7=TRUE,$H$9=TRUE),P65,IF($H$7=TRUE,J65,\"\"))),\"\")","v":3},{"$f":"IF($H$21=TRUE,IF(J65<=$H$2,S65,\"\"),\"\")","v":"grau"}]
[null,null,null,null,null,null,null,null,null,null,null,null,null,null,null,null,null,null,null,null,null,null,null,{"$f":"CONCATENATE(\"(\",Y5,\", \",Z5,\")\")","v":"(8, grün)"},8,"grün",null,2,"grün"]
[null,null,null,null,null,null,null,null,null,null,null,null,null,null,null,null,null,null,null,null,null,null,null,"(4, grün)",4,"grün",null,8,"rot"]
[null,null,null,null,null,null,null,false,null,null,null,null,null,null,null,null,null,null,null,null,null,null,null,"(2, grau)",2,"grau",null,7,"rot"]
[null,null,null,null,null,null,null,null,null,null,null,null,null,null,null,null,null,null,null,null,null,null,null,"(2, grün)",2,"grün",null,3,"grün"]
[null,null,null,null,null,null,null,false,null,null,null,null,null,null,null,null,null,null,null,null,null,null,null,"(5, gelb)",5,"gelb",null,6,"gelb"]
[null,null,null,null,null,null,null,null,null,null,null,null,null,null,null,null,null,null,null,null,null,null,null,"(8, blau)",8,"blau",null,8,"grau"]
[null,"oder",null,null,null,null,null,null,null,null,null,null,null,null,null,null,null,null,null,null,null,null,null,"(9, grün)",9,"grün",null,7,"gelb"]
[null,null,null,null,null,null,null,null,null,null,null,null,null,null,null,null,null,null,null,null,null,null,null,"(6, gelb)",6,"gelb",null,9,"grün"]
[null,null,null,null,null,null,null,null,null,null,null,null,null,null,null,null,null,null,null,null,null,null,null,"(7, gelb)",7,"gelb",null,8,"gelb"]
[null,null,null,null,null,null,null,true,null,null,null,null,null,null,null,null,null,null,null,null,null,null,null,"(8, grün)",8,"grün",null,7,"grün"]
[null,null,null,null,null,null,null,null,null,null,null,null,null,null,null,null,null,null,null,null,null,null,null,"(7, grau)",7,"grau",null,7,"rot"]
[null,null,"Minimum",null,null,null,null,2,null,null,null,null,null,null,null,null,null,null,null,null,null,null,null,"(4, grau)",4,"grau",null,7,"grün",null,null,null,"Schritte 1. - 5. können per Makro durchgeführt werden mit Tastenkombination:"]
[null,null,null,null,null,null,null,null,null,null,null,null,null,null,null,null,null,null,null,null,null,null,null,"(2, grau)",2,"grau",null,7,"rot"]
[null,null,"Maximum",null,null,null,null,9,null,null,null,null,null,null,null,null,null,null,null,null,null,null,null,"(5, gelb)",5,"gelb",null,5,"grau"]
[null,null,null,null,null,null,null,null,null,null,null,null,null,null,null,null,null,null,null,null,null,null,null,"(3, gelb)",3,"gelb",null,5,"rot"]
[null,null,null,null,null,null,null,null,null,null,null,null,null,null,null,null,null,null,null,null,null,null,null,"(7, rot)",7,"rot",null,2,"rot"]
[null,null,null,null,null,null,null,true,null,null,null,null,null,null,null,null,null,null,null,null,null,null,null,"(5, grau)",5,"grau",null,7,"blau"]
[null,null,null,null,null,null,null,null,null,null,null,null,null,null,null,null,null,null,null,null,null,null,null,"(2, blau)",2,"blau",null,3,"grün"]
[null,null,"Anzahl der Farben",null,null,null,null,5,null,null,null,null,null,null,null,null,null,null,null,null,null,null,null,"(9, gelb)",9,"gelb",null,7,"rot"]
[null,null,null,null,null,null,null,null,null,null,null,null,null,null,null,null,null,null,null,null,null,null,null,"(8, grün)",8,"grün",null,6,"blau",null,null,null,null,null,null,null,"Strg + N"]
[null,null,null,null,null,null,null,null,null,null,null,null,null,null,null,null,null,null,null,null,null,null,null,"(2, rot)",2,"rot",null,3,"grün"]
[null,null,null,null,null,null,null,null,null,null,null,null,null,null,null,null,null,null,null,null,null,null,null,"(2, grau)",2,"grau",null,3,"grün"]
[null,null,null,null,null,null,null,null,null,null,null,null,null,null,null,null,null,null,null,null,null,null,null,"(2, grün)",2,"grün",null,7,"gelb"]
[null,null,null,null,null,null,null,null,null,null,null,null,null,null,null,null,null,null,null,null,null,null,null,"(5, grau)",5,"grau",null,3,"gelb"]
[null,null,null,null,null,null,null,null,null,null,null,null,null,null,null,null,null,null,null,null,null,null,null,"(9, blau)",9,"blau",null,4,"blau"]
[null,null,null,null,null,null,null,null,null,null,null,null,null,null,null,null,null,null,null,null,null,null,null,"(4, grün)",4,"grün",null,2,"gelb"]
[null,null,null,null,null,null,null,null,null,null,null,null,null,null,null,null,null,null,null,null,null,null,null,"(3, grau)",3,"grau",null,2,"gelb"]
[null,null,null,null,null,null,null,null,null,null,null,null,null,null,null,null,null,null,null,null,null,null,null,"(6, rot)",6,"rot",null,8,"grün"]
[null,null,null,null,null,null,null,null,null,null,null,null,null,null,null,null,null,null,null,null,null,null,null,"(9, gelb)",9,"gelb",null,4,"gelb"]
[null,null,null,null,null,null,null,null,null,null,null,null,null,null,null,null,null,null,null,null,null,null,null,"(7, grau)",7,"grau",null,7,"blau"]
[null,null,null,null,null,null,null,null,null,null,null,null,null,null,null,null,null,null,null,null,null,null,null,"(7, blau)",7,"blau",null,8,"blau"]
[null,null,null,null,null,null,null,null,null,null,null,null,null,null,null,null,null,null,null,null,null,null,null,"(6, rot)",6,"rot",null,{"$f":"IF(J97<=$H$2,IF($H$14=TRUE,Q97,IF(AND($H$7=TRUE,$H$9=TRUE),P97,IF($H$7=TRUE,J97,\"\"))),\"\")","v":4},{"$f":"IF($H$21=TRUE,IF(J97<=$H$2,S97,\"\"),\"\")","v":"grau"}]
[null,null,null,null,null,null,null,null,null,null,null,null,null,null,null,null,null,null,null,null,null,null,null,"(5, grün)",5,"grün",null,7,"rot"]
[null,null,null,null,null,null,null,null,null,null,null,null,null,null,null,null,null,null,null,null,null,null,null,"(7, grün)",7,"grün",null,2,"gelb"]
[null,null,null,null,null,null,null,null,null,null,null,null,null,null,null,null,null,null,null,null,null,null,null,"(5, blau)",5,"blau",null,5,"grün"]
[null,null,null,null,null,null,null,null,null,null,null,null,null,null,null,null,null,null,null,null,null,null,null,"(2, grau)",2,"grau",null,6,"grün"]
[null,null,null,null,null,null,null,null,null,null,null,null,null,null,null,null,null,null,null,null,null,null,null,"(9, grün)",9,"grün",null,9,"rot"]
[null,null,null,null,null,null,null,null,null,null,null,null,null,null,null,null,null,null,null,null,null,null,null,"(6, grün)",6,"grün",null,3,"rot"]
[null,null,null,null,null,null,null,null,null,null,null,null,null,null,null,null,null,null,null,null,null,null,null,"(8, rot)",8,"rot",null,4,"rot"]
[null,null,null,null,null,null,null,null,null,null,null,null,null,null,null,null,null,null,null,null,null,null,null,"(4, rot)",4,"rot",null,2,"grau"]
[null,null,null,null,null,null,null,null,null,null,null,null,null,null,null,null,null,null,null,null,null,null,null,"(6, gelb)",6,"gelb",null,3,"rot"]
[null,null,null,null,null,null,null,null,null,null,null,null,null,null,null,null,null,null,null,null,null,null,null,"(5, blau)",5,"blau",null,3,"blau"]
[null,null,null,null,null,null,null,null,null,null,null,null,null,null,null,null,null,null,null,null,null,null,null,"(6, grau)",6,"grau",null,3,"blau"]
[null,null,null,null,null,null,null,null,null,null,null,null,null,null,null,null,null,null,null,null,null,null,null,"(3, grün)",3,"grün",null,2,"grün"]
[null,null,null,null,null,null,null,null,null,null,null,null,null,null,null,null,null,null,null,null,null,null,null,"(6, grün)",6,"grün",null,7,"blau"]
[null,null,null,null,null,null,null,null,null,null,null,null,null,null,null,null,null,null,null,null,null,null,null,"(8, grau)",8,"grau",null,9,"grau"]
[null,null,null,null,null,null,null,null,null,null,null,null,null,null,null,null,null,null,null,null,null,null,null,"(4, gelb)",4,"gelb",null,5,"rot"]
[null,null,null,null,null,null,null,null,null,null,null,null,null,null,null,null,null,null,null,null,null,null,null,"(9, blau)",9,"blau",null,9,"grün"]
[]
[null,null,null,null,null,null,null,null,null,null,null,null,null,null,null,null,null,null,null,null,null,null,null,"Anzahl:",{"$f":"IF(COUNTBLANK(Y4:Y52)<49,49-COUNTBLANK(Y4:Y52),IF(COUNTBLANK(Z4:Z52)<49,49-COUNTBLANK(Z4:Z52),0))","v":49}]
[]
[]
[]
[]
[]
[]
[]
[]
[null,null,null,null,null,null,null,null,null,null,null,null,null,null,null,"umsortiert",null,null,null,null,"Farbnr."]
[null,null,null,null,null,null,null,null,null,"Nr.","Zahl","Farbnr.","Farbe","Zufallszahl","Sortierung","Nr.","Zahl","Farbnr.","Farbe",null,"rot",null,1]
[null,null,null,null,null,null,null,null,null,1,{"$f":"RANDBETWEEN($H$16,$H$18)","v":7},{"$f":"RANDBETWEEN(1,$H$23)","v":3},{"$f":"IF(L65=$W$64,$U$64,IF(L65=$W$65,$U$65,IF(L65=$W$66,$U$66,IF(L65=$W$67,$U$67,IF(L65=$W$68,$U$68)))))","v":"blau"},{"$f":"ROUND(RAND(),30)","v":0.25296024062302203},{"$f":"SMALL($N$65:INDIRECT(\"$N\"&ROW($J$65)+$H$2-1),J65)","v":9.1785166344804603E-2},{"$f":"MATCH(N65,$O$65:INDIRECT(\"$O\"&ROW($J$65)+$H$2-1),1)","v":11},{"$f":"INDEX($K$65:INDIRECT(\"$K\"&ROW($J$65)+$H$2-1),P65)","v":3},{"$f":"INDEX($L$65:INDIRECT(\"$L\"&ROW($J$65)+$H$2-1),P65)","v":5},{"$f":"INDEX($M$65:INDIRECT(\"$M\"&ROW($J$65)+$H$2-1),P65)","v":"grau"},null,"grün",null,2]
[null,null,null,null,null,null,null,null,null,2,5,2,"grün",{"$f":"ROUND(RAND(),30)","v":0.56191093319422203},{"$f":"SMALL($N$65:INDIRECT(\"$N\"&ROW($J$65)+$H$2-1),J66)","v":9.6091391287499398E-2},{"$f":"MATCH(N66,$O$65:INDIRECT(\"$O\"&ROW($J$65)+$H$2-1),1)","v":28},{"$f":"INDEX($K$65:INDIRECT(\"$K\"&ROW($J$65)+$H$2-1),P66)","v":2},{"$f":"INDEX($L$65:INDIRECT(\"$L\"&ROW($J$65)+$H$2-1),P66)","v":2},{"$f":"INDEX($M$65:INDIRECT(\"$M\"&ROW($J$65)+$H$2-1),P66)","v":"grün"},null,"blau",null,3]
[null,null,null,null,null,null,null,null,null,3,8,5,"grau",0.84408356486903702,{"$f":"SMALL($N$65:INDIRECT(\"$N\"&ROW($J$65)+$H$2-1),J67)","v":9.9664385114799997E-2},{"$f":"MATCH(N67,$O$65:INDIRECT(\"$O\"&ROW($J$65)+$H$2-1),1)","v":41},{"$f":"INDEX($K$65:INDIRECT(\"$K\"&ROW($J$65)+$H$2-1),P67)","v":8},{"$f":"INDEX($L$65:INDIRECT(\"$L\"&ROW($J$65)+$H$2-1),P67)","v":1},{"$f":"INDEX($M$65:INDIRECT(\"$M\"&ROW($J$65)+$H$2-1),P67)","v":"rot"},null,"gelb",null,4]
[null,null,null,null,null,null,null,null,null,4,2,4,"gelb",0.31311117387960102,{"$f":"SMALL($N$65:INDIRECT(\"$N\"&ROW($J$65)+$H$2-1),J68)","v":0.12260798600267001},{"$f":"MATCH(N68,$O$65:INDIRECT(\"$O\"&ROW($J$65)+$H$2-1),1)","v":19},{"$f":"INDEX($K$65:INDIRECT(\"$K\"&ROW($J$65)+$H$2-1),P68)","v":7},{"$f":"INDEX($L$65:INDIRECT(\"$L\"&ROW($J$65)+$H$2-1),P68)","v":1},{"$f":"INDEX($M$65:INDIRECT(\"$M\"&ROW($J$65)+$H$2-1),P68)","v":"rot"},null,"grau",null,5]
[null,null,null,null,null,null,null,null,null,5,3,2,"grün",0.91621652699648304,{"$f":"SMALL($N$65:INDIRECT(\"$N\"&ROW($J$65)+$H$2-1),J69)","v":0.13777169988756599},{"$f":"MATCH(N69,$O$65:INDIRECT(\"$O\"&ROW($J$65)+$H$2-1),1)","v":44},{"$f":"INDEX($K$65:INDIRECT(\"$K\"&ROW($J$65)+$H$2-1),P69)","v":3},{"$f":"INDEX($L$65:INDIRECT(\"$L\"&ROW($J$65)+$H$2-1),P69)","v":2},{"$f":"INDEX($M$65:INDIRECT(\"$M\"&ROW($J$65)+$H$2-1),P69)","v":"grün"}]
[null,null,null,null,null,null,null,null,null,6,7,3,"blau",0.26452847577979399,{"$f":"SMALL($N$65:INDIRECT(\"$N\"&ROW($J$65)+$H$2-1),J70)","v":0.14938949526181999},{"$f":"MATCH(N70,$O$65:INDIRECT(\"$O\"&ROW($J$65)+$H$2-1),1)","v":14},{"$f":"INDEX($K$65:INDIRECT(\"$K\"&ROW($J$65)+$H$2-1),P70)","v":6},{"$f":"INDEX($L$65:INDIRECT(\"$L\"&ROW($J$65)+$H$2-1),P70)","v":4},{"$f":"INDEX($M$65:INDIRECT(\"$M\"&ROW($J$65)+$H$2-1),P70)","v":"gelb"}]
[null,null,null,null,null,null,null,null,null,7,3,3,"blau",9.9664385114799997E-2,{"$f":"SMALL($N$65:INDIRECT(\"$N\"&ROW($J$65)+$H$2-1),J71)","v":0.18954975595620499},{"$f":"MATCH(N71,$O$65:INDIRECT(\"$O\"&ROW($J$65)+$H$2-1),1)","v":3},{"$f":"INDEX($K$65:INDIRECT(\"$K\"&ROW($J$65)+$H$2-1),P71)","v":8},{"$f":"INDEX($L$65:INDIRECT(\"$L\"&ROW($J$65)+$H$2-1),P71)","v":5},{"$f":"INDEX($M$65:INDIRECT(\"$M\"&ROW($J$65)+$H$2-1),P71)","v":"grau"}]
[null,null,null,null,null,null,null,null,null,8,7,4,"gelb",0.31704430708042702,{"$f":"SMALL($N$65:INDIRECT(\"$N\"&ROW($J$65)+$H$2-1),J72)","v":0.19766822376021401},{"$f":"MATCH(N72,$O$65:INDIRECT(\"$O\"&ROW($J$65)+$H$2-1),1)","v":20},{"$f":"INDEX($K$65:INDIRECT(\"$K\"&ROW($J$65)+$H$2-1),P72)","v":7},{"$f":"INDEX($L$65:INDIRECT(\"$L\"&ROW($J$65)+$H$2-1),P72)","v":4},{"$f":"INDEX($M$65:INDIRECT(\"$M\"&ROW($J$65)+$H$2-1),P72)","v":"gelb"}]
[null,null,null,null,null,null,null,null,null,9,2,5,"grau",0.26195752144374101,{"$f":"SMALL($N$65:INDIRECT(\"$N\"&ROW($J$65)+$H$2-1),J73)","v":0.20223882623266201},{"$f":"MATCH(N73,$O$65:INDIRECT(\"$O\"&ROW($J$65)+$H$2-1),1)","v":13},{"$f":"INDEX($K$65:INDIRECT(\"$K\"&ROW($J$65)+$H$2-1),P73)","v":9},{"$f":"INDEX($L$65:INDIRECT(\"$L\"&ROW($J$65)+$H$2-1),P73)","v":2},{"$f":"INDEX($M$65:INDIRECT(\"$M\"&ROW($J$65)+$H$2-1),P73)","v":"grün"}]
[null,null,null,null,null,null,null,null,null,10,5,1,"rot",0.83751797005789996,{"$f":"SMALL($N$65:INDIRECT(\"$N\"&ROW($J$65)+$H$2-1),J74)","v":0.233464572036332},{"$f":"MATCH(N74,$O$65:INDIRECT(\"$O\"&ROW($J$65)+$H$2-1),1)","v":40},{"$f":"INDEX($K$65:INDIRECT(\"$K\"&ROW($J$65)+$H$2-1),P74)","v":8},{"$f":"INDEX($L$65:INDIRECT(\"$L\"&ROW($J$65)+$H$2-1),P74)","v":4},{"$f":"INDEX($M$65:INDIRECT(\"$M\"&ROW($J$65)+$H$2-1),P74)","v":"gelb"}]
[null,null,null,null,null,null,null,null,null,11,3,5,"grau",0.36548630403249999,{"$f":"SMALL($N$65:INDIRECT(\"$N\"&ROW($J$65)+$H$2-1),J75)","v":0.25296024062302203},{"$f":"MATCH(N75,$O$65:INDIRECT(\"$O\"&ROW($J$65)+$H$2-1),1)","v":21},{"$f":"INDEX($K$65:INDIRECT(\"$K\"&ROW($J$65)+$H$2-1),P75)","v":7},{"$f":"INDEX($L$65:INDIRECT(\"$L\"&ROW($J$65)+$H$2-1),P75)","v":2},{"$f":"INDEX($M$65:INDIRECT(\"$M\"&ROW($J$65)+$H$2-1),P75)","v":"grün"}]
[null,null,null,null,null,null,null,null,null,12,7,1,"rot",0.51151126408599101,{"$f":"SMALL($N$65:INDIRECT(\"$N\"&ROW($J$65)+$H$2-1),J76)","v":0.25972208728718199},{"$f":"MATCH(N76,$O$65:INDIRECT(\"$O\"&ROW($J$65)+$H$2-1),1)","v":26},{"$f":"INDEX($K$65:INDIRECT(\"$K\"&ROW($J$65)+$H$2-1),P76)","v":7},{"$f":"INDEX($L$65:INDIRECT(\"$L\"&ROW($J$65)+$H$2-1),P76)","v":1},{"$f":"INDEX($M$65:INDIRECT(\"$M\"&ROW($J$65)+$H$2-1),P76)","v":"rot"}]
[null,null,null,null,null,null,null,null,null,13,9,2,"grün",0.39156320206422801,{"$f":"SMALL($N$65:INDIRECT(\"$N\"&ROW($J$65)+$H$2-1),J77)","v":0.26195752144374101},{"$f":"MATCH(N77,$O$65:INDIRECT(\"$O\"&ROW($J$65)+$H$2-1),1)","v":22},{"$f":"INDEX($K$65:INDIRECT(\"$K\"&ROW($J$65)+$H$2-1),P77)","v":7},{"$f":"INDEX($L$65:INDIRECT(\"$L\"&ROW($J$65)+$H$2-1),P77)","v":2},{"$f":"INDEX($M$65:INDIRECT(\"$M\"&ROW($J$65)+$H$2-1),P77)","v":"grün"}]
[null,null,null,null,null,null,null,null,null,14,6,4,"gelb",0.55887756956310897,{"$f":"SMALL($N$65:INDIRECT(\"$N\"&ROW($J$65)+$H$2-1),J78)","v":0.26452847577979399},{"$f":"MATCH(N78,$O$65:INDIRECT(\"$O\"&ROW($J$65)+$H$2-1),1)","v":27},{"$f":"INDEX($K$65:INDIRECT(\"$K\"&ROW($J$65)+$H$2-1),P78)","v":7},{"$f":"INDEX($L$65:INDIRECT(\"$L\"&ROW($J$65)+$H$2-1),P78)","v":1},{"$f":"INDEX($M$65:INDIRECT(\"$M\"&ROW($J$65)+$H$2-1),P78)","v":"rot"}]
[null,null,null,null,null,null,null,null,null,15,9,5,"grau",0.95584138772021099,{"$f":"SMALL($N$65:INDIRECT(\"$N\"&ROW($J$65)+$H$2-1),J79)","v":0.276642771004598},{"$f":"MATCH(N79,$O$65:INDIRECT(\"$O\"&ROW($J$65)+$H$2-1),1)","v":45},{"$f":"INDEX($K$65:INDIRECT(\"$K\"&ROW($J$65)+$H$2-1),P79)","v":5},{"$f":"INDEX($L$65:INDIRECT(\"$L\"&ROW($J$65)+$H$2-1),P79)","v":5},{"$f":"INDEX($M$65:INDIRECT(\"$M\"&ROW($J$65)+$H$2-1),P79)","v":"grau"}]
[null,null,null,null,null,null,null,null,null,16,9,2,"grün",0.233464572036332,{"$f":"SMALL($N$65:INDIRECT(\"$N\"&ROW($J$65)+$H$2-1),J80)","v":0.28952575862171698},{"$f":"MATCH(N80,$O$65:INDIRECT(\"$O\"&ROW($J$65)+$H$2-1),1)","v":10},{"$f":"INDEX($K$65:INDIRECT(\"$K\"&ROW($J$65)+$H$2-1),P80)","v":5},{"$f":"INDEX($L$65:INDIRECT(\"$L\"&ROW($J$65)+$H$2-1),P80)","v":1},{"$f":"INDEX($M$65:INDIRECT(\"$M\"&ROW($J$65)+$H$2-1),P80)","v":"rot"}]
[null,null,null,null,null,null,null,null,null,17,6,3,"blau",0.89950155412110799,{"$f":"SMALL($N$65:INDIRECT(\"$N\"&ROW($J$65)+$H$2-1),J81)","v":0.29604340395127399},{"$f":"MATCH(N81,$O$65:INDIRECT(\"$O\"&ROW($J$65)+$H$2-1),1)","v":43},{"$f":"INDEX($K$65:INDIRECT(\"$K\"&ROW($J$65)+$H$2-1),P81)","v":2},{"$f":"INDEX($L$65:INDIRECT(\"$L\"&ROW($J$65)+$H$2-1),P81)","v":1},{"$f":"INDEX($M$65:INDIRECT(\"$M\"&ROW($J$65)+$H$2-1),P81)","v":"rot"}]
[null,null,null,null,null,null,null,null,null,18,2,4,"gelb",0.14938949526181999,{"$f":"SMALL($N$65:INDIRECT(\"$N\"&ROW($J$65)+$H$2-1),J82)","v":0.302029938609918},{"$f":"MATCH(N82,$O$65:INDIRECT(\"$O\"&ROW($J$65)+$H$2-1),1)","v":6},{"$f":"INDEX($K$65:INDIRECT(\"$K\"&ROW($J$65)+$H$2-1),P82)","v":7},{"$f":"INDEX($L$65:INDIRECT(\"$L\"&ROW($J$65)+$H$2-1),P82)","v":3},{"$f":"INDEX($M$65:INDIRECT(\"$M\"&ROW($J$65)+$H$2-1),P82)","v":"blau"}]
[null,null,null,null,null,null,null,null,null,19,7,1,"rot",0.13777169988756599,{"$f":"SMALL($N$65:INDIRECT(\"$N\"&ROW($J$65)+$H$2-1),J83)","v":0.31311117387960102},{"$f":"MATCH(N83,$O$65:INDIRECT(\"$O\"&ROW($J$65)+$H$2-1),1)","v":5},{"$f":"INDEX($K$65:INDIRECT(\"$K\"&ROW($J$65)+$H$2-1),P83)","v":3},{"$f":"INDEX($L$65:INDIRECT(\"$L\"&ROW($J$65)+$H$2-1),P83)","v":2},{"$f":"INDEX($M$65:INDIRECT(\"$M\"&ROW($J$65)+$H$2-1),P83)","v":"grün"}]
[null,null,null,null,null,null,null,null,null,20,7,4,"gelb",0.25972208728718199,{"$f":"SMALL($N$65:INDIRECT(\"$N\"&ROW($J$65)+$H$2-1),J84)","v":0.31704430708042702},{"$f":"MATCH(N84,$O$65:INDIRECT(\"$O\"&ROW($J$65)+$H$2-1),1)","v":12},{"$f":"INDEX($K$65:INDIRECT(\"$K\"&ROW($J$65)+$H$2-1),P84)","v":7},{"$f":"INDEX($L$65:INDIRECT(\"$L\"&ROW($J$65)+$H$2-1),P84)","v":1},{"$f":"INDEX($M$65:INDIRECT(\"$M\"&ROW($J$65)+$H$2-1),P84)","v":"rot"}]
[null,null,null,null,null,null,null,null,null,21,7,2,"grün",0.29604340395127399,{"$f":"SMALL($N$65:INDIRECT(\"$N\"&ROW($J$65)+$H$2-1),J85)","v":0.36548630403249999},{"$f":"MATCH(N85,$O$65:INDIRECT(\"$O\"&ROW($J$65)+$H$2-1),1)","v":17},{"$f":"INDEX($K$65:INDIRECT(\"$K\"&ROW($J$65)+$H$2-1),P85)","v":6},{"$f":"INDEX($L$65:INDIRECT(\"$L\"&ROW($J$65)+$H$2-1),P85)","v":3},{"$f":"INDEX($M$65:INDIRECT(\"$M\"&ROW($J$65)+$H$2-1),P85)","v":"blau"}]
[null,null,null,null,null,null,null,null,null,22,7,2,"grün",0.72669178607459595,{"$f":"SMALL($N$65:INDIRECT(\"$N\"&ROW($J$65)+$H$2-1),J86)","v":0.39156320206422801},{"$f":"MATCH(N86,$O$65:INDIRECT(\"$O\"&ROW($J$65)+$H$2-1),1)","v":37},{"$f":"INDEX($K$65:INDIRECT(\"$K\"&ROW($J$65)+$H$2-1),P86)","v":3},{"$f":"INDEX($L$65:INDIRECT(\"$L\"&ROW($J$65)+$H$2-1),P86)","v":2},{"$f":"INDEX($M$65:INDIRECT(\"$M\"&ROW($J$65)+$H$2-1),P86)","v":"grün"}]
[null,null,null,null,null,null,null,null,null,23,7,1,"rot",0.63519509622539005,{"$f":"SMALL($N$65:INDIRECT(\"$N\"&ROW($J$65)+$H$2-1),J87)","v":0.42256179838619701},{"$f":"MATCH(N87,$O$65:INDIRECT(\"$O\"&ROW($J$65)+$H$2-1),1)","v":31},{"$f":"INDEX($K$65:INDIRECT(\"$K\"&ROW($J$65)+$H$2-1),P87)","v":3},{"$f":"INDEX($L$65:INDIRECT(\"$L\"&ROW($J$65)+$H$2-1),P87)","v":2},{"$f":"INDEX($M$65:INDIRECT(\"$M\"&ROW($J$65)+$H$2-1),P87)","v":"grün"}]
[null,null,null,null,null,null,null,null,null,24,8,2,"grün",0.19766822376021401,{"$f":"SMALL($N$65:INDIRECT(\"$N\"&ROW($J$65)+$H$2-1),J88)","v":0.44748389186299697},{"$f":"MATCH(N88,$O$65:INDIRECT(\"$O\"&ROW($J$65)+$H$2-1),1)","v":8},{"$f":"INDEX($K$65:INDIRECT(\"$K\"&ROW($J$65)+$H$2-1),P88)","v":7},{"$f":"INDEX($L$65:INDIRECT(\"$L\"&ROW($J$65)+$H$2-1),P88)","v":4},{"$f":"INDEX($M$65:INDIRECT(\"$M\"&ROW($J$65)+$H$2-1),P88)","v":"gelb"}]
[null,null,null,null,null,null,null,null,null,25,4,4,"gelb",0.97991568902993897,{"$f":"SMALL($N$65:INDIRECT(\"$N\"&ROW($J$65)+$H$2-1),J89)","v":0.47788696514482498},{"$f":"MATCH(N89,$O$65:INDIRECT(\"$O\"&ROW($J$65)+$H$2-1),1)","v":48},{"$f":"INDEX($K$65:INDIRECT(\"$K\"&ROW($J$65)+$H$2-1),P89)","v":3},{"$f":"INDEX($L$65:INDIRECT(\"$L\"&ROW($J$65)+$H$2-1),P89)","v":4},{"$f":"INDEX($M$65:INDIRECT(\"$M\"&ROW($J$65)+$H$2-1),P89)","v":"gelb"}]
[null,null,null,null,null,null,null,null,null,26,7,1,"rot",0.88894434125301003,{"$f":"SMALL($N$65:INDIRECT(\"$N\"&ROW($J$65)+$H$2-1),J90)","v":0.51151126408599101},{"$f":"MATCH(N90,$O$65:INDIRECT(\"$O\"&ROW($J$65)+$H$2-1),1)","v":42},{"$f":"INDEX($K$65:INDIRECT(\"$K\"&ROW($J$65)+$H$2-1),P90)","v":4},{"$f":"INDEX($L$65:INDIRECT(\"$L\"&ROW($J$65)+$H$2-1),P90)","v":3},{"$f":"INDEX($M$65:INDIRECT(\"$M\"&ROW($J$65)+$H$2-1),P90)","v":"blau"}]
[null,null,null,null,null,null,null,null,null,27,7,1,"rot",0.302029938609918,{"$f":"SMALL($N$65:INDIRECT(\"$N\"&ROW($J$65)+$H$2-1),J91)","v":0.55887756956310897},{"$f":"MATCH(N91,$O$65:INDIRECT(\"$O\"&ROW($J$65)+$H$2-1),1)","v":18},{"$f":"INDEX($K$65:INDIRECT(\"$K\"&ROW($J$65)+$H$2-1),P91)","v":2},{"$f":"INDEX($L$65:INDIRECT(\"$L\"&ROW($J$65)+$H$2-1),P91)","v":4},{"$f":"INDEX($M$65:INDIRECT(\"$M\"&ROW($J$65)+$H$2-1),P91)","v":"gelb"}]
[null,null,null,null,null,null,null,null,null,28,2,2,"grün",0.69173078062863502,{"$f":"SMALL($N$65:INDIRECT(\"$N\"&ROW($J$65)+$H$2-1),J92)","v":0.56191093319422203},{"$f":"MATCH(N92,$O$65:INDIRECT(\"$O\"&ROW($J$65)+$H$2-1),1)","v":34},{"$f":"INDEX($K$65:INDIRECT(\"$K\"&ROW($J$65)+$H$2-1),P92)","v":2},{"$f":"INDEX($L$65:INDIRECT(\"$L\"&ROW($J$65)+$H$2-1),P92)","v":4},{"$f":"INDEX($M$65:INDIRECT(\"$M\"&ROW($J$65)+$H$2-1),P92)","v":"gelb"}]
[null,null,null,null,null,null,null,null,null,29,4,1,"rot",0.44748389186299697,{"$f":"SMALL($N$65:INDIRECT(\"$N\"&ROW($J$65)+$H$2-1),J93)","v":0.58357349726612395},{"$f":"MATCH(N93,$O$65:INDIRECT(\"$O\"&ROW($J$65)+$H$2-1),1)","v":24},{"$f":"INDEX($K$65:INDIRECT(\"$K\"&ROW($J$65)+$H$2-1),P93)","v":8},{"$f":"INDEX($L$65:INDIRECT(\"$L\"&ROW($J$65)+$H$2-1),P93)","v":2},{"$f":"INDEX($M$65:INDIRECT(\"$M\"&ROW($J$65)+$H$2-1),P93)","v":"grün"}]
[null,null,null,null,null,null,null,null,null,30,5,1,"rot",0.47788696514482498,{"$f":"SMALL($N$65:INDIRECT(\"$N\"&ROW($J$65)+$H$2-1),J94)","v":0.63066775185579205},{"$f":"MATCH(N94,$O$65:INDIRECT(\"$O\"&ROW($J$65)+$H$2-1),1)","v":25},{"$f":"INDEX($K$65:INDIRECT(\"$K\"&ROW($J$65)+$H$2-1),P94)","v":4},{"$f":"INDEX($L$65:INDIRECT(\"$L\"&ROW($J$65)+$H$2-1),P94)","v":4},{"$f":"INDEX($M$65:INDIRECT(\"$M\"&ROW($J$65)+$H$2-1),P94)","v":"gelb"}]
[null,null,null,null,null,null,null,null,null,31,3,2,"grün",9.1785166344804603E-2,{"$f":"SMALL($N$65:INDIRECT(\"$N\"&ROW($J$65)+$H$2-1),J95)","v":0.63519509622539005},{"$f":"MATCH(N95,$O$65:INDIRECT(\"$O\"&ROW($J$65)+$H$2-1),1)","v":1},{"$f":"INDEX($K$65:INDIRECT(\"$K\"&ROW($J$65)+$H$2-1),P95)","v":7},{"$f":"INDEX($L$65:INDIRECT(\"$L\"&ROW($J$65)+$H$2-1),P95)","v":3},{"$f":"INDEX($M$65:INDIRECT(\"$M\"&ROW($J$65)+$H$2-1),P95)","v":"blau"}]
[null,null,null,null,null,null,null,null,null,32,9,1,"rot",0.74872326767867803,{"$f":"SMALL($N$65:INDIRECT(\"$N\"&ROW($J$65)+$H$2-1),J96)","v":0.67135395557354405},{"$f":"MATCH(N96,$O$65:INDIRECT(\"$O\"&ROW($J$65)+$H$2-1),1)","v":39},{"$f":"INDEX($K$65:INDIRECT(\"$K\"&ROW($J$65)+$H$2-1),P96)","v":8},{"$f":"INDEX($L$65:INDIRECT(\"$L\"&ROW($J$65)+$H$2-1),P96)","v":3},{"$f":"INDEX($M$65:INDIRECT(\"$M\"&ROW($J$65)+$H$2-1),P96)","v":"blau"}]
[null,null,null,null,null,null,null,null,null,33,{"$f":"RANDBETWEEN($H$16,$H$18)","v":2},{"$f":"RANDBETWEEN(1,$H$23)","v":2},{"$f":"IF(L97=$W$64,$U$64,IF(L97=$W$65,$U$65,IF(L97=$W$66,$U$66,IF(L97=$W$67,$U$67,IF(L97=$W$68,$U$68)))))","v":"grün"},0.74090531823072703,{"$f":"SMALL($N$65:INDIRECT(\"$N\"&ROW($J$65)+$H$2-1),J97)","v":0.68829127923190903},{"$f":"MATCH(N97,$O$65:INDIRECT(\"$O\"&ROW($J$65)+$H$2-1),1)","v":38},{"$f":"INDEX($K$65:INDIRECT(\"$K\"&ROW($J$65)+$H$2-1),P97)","v":4},{"$f":"INDEX($L$65:INDIRECT(\"$L\"&ROW($J$65)+$H$2-1),P97)","v":5},{"$f":"INDEX($M$65:INDIRECT(\"$M\"&ROW($J$65)+$H$2-1),P97)","v":"grau"}]
[null,null,null,null,null,null,null,null,null,34,2,4,"gelb",0.42256179838619701,{"$f":"SMALL($N$65:INDIRECT(\"$N\"&ROW($J$65)+$H$2-1),J98)","v":0.69173078062863502},{"$f":"MATCH(N98,$O$65:INDIRECT(\"$O\"&ROW($J$65)+$H$2-1),1)","v":23},{"$f":"INDEX($K$65:INDIRECT(\"$K\"&ROW($J$65)+$H$2-1),P98)","v":7},{"$f":"INDEX($L$65:INDIRECT(\"$L\"&ROW($J$65)+$H$2-1),P98)","v":1},{"$f":"INDEX($M$65:INDIRECT(\"$M\"&ROW($J$65)+$H$2-1),P98)","v":"rot"}]
[null,null,null,null,null,null,null,null,null,35,3,1,"rot",0.12260798600267001,{"$f":"SMALL($N$65:INDIRECT(\"$N\"&ROW($J$65)+$H$2-1),J99)","v":0.69619470019395002},{"$f":"MATCH(N99,$O$65:INDIRECT(\"$O\"&ROW($J$65)+$H$2-1),1)","v":4},{"$f":"INDEX($K$65:INDIRECT(\"$K\"&ROW($J$65)+$H$2-1),P99)","v":2},{"$f":"INDEX($L$65:INDIRECT(\"$L\"&ROW($J$65)+$H$2-1),P99)","v":4},{"$f":"INDEX($M$65:INDIRECT(\"$M\"&ROW($J$65)+$H$2-1),P99)","v":"gelb"}]
[null,null,null,null,null,null,null,null,null,36,6,2,"grün",9.6091391287499398E-2,{"$f":"SMALL($N$65:INDIRECT(\"$N\"&ROW($J$65)+$H$2-1),J100)","v":0.70378326541201797},{"$f":"MATCH(N100,$O$65:INDIRECT(\"$O\"&ROW($J$65)+$H$2-1),1)","v":2},{"$f":"INDEX($K$65:INDIRECT(\"$K\"&ROW($J$65)+$H$2-1),P100)","v":5},{"$f":"INDEX($L$65:INDIRECT(\"$L\"&ROW($J$65)+$H$2-1),P100)","v":2},{"$f":"INDEX($M$65:INDIRECT(\"$M\"&ROW($J$65)+$H$2-1),P100)","v":"grün"}]
[null,null,null,null,null,null,null,null,null,37,3,2,"grün",0.70378326541201797,{"$f":"SMALL($N$65:INDIRECT(\"$N\"&ROW($J$65)+$H$2-1),J101)","v":0.72669178607459595},{"$f":"MATCH(N101,$O$65:INDIRECT(\"$O\"&ROW($J$65)+$H$2-1),1)","v":36},{"$f":"INDEX($K$65:INDIRECT(\"$K\"&ROW($J$65)+$H$2-1),P101)","v":6},{"$f":"INDEX($L$65:INDIRECT(\"$L\"&ROW($J$65)+$H$2-1),P101)","v":2},{"$f":"INDEX($M$65:INDIRECT(\"$M\"&ROW($J$65)+$H$2-1),P101)","v":"grün"}]
[null,null,null,null,null,null,null,null,null,38,4,5,"grau",0.67135395557354405,{"$f":"SMALL($N$65:INDIRECT(\"$N\"&ROW($J$65)+$H$2-1),J102)","v":0.74090531823072703},{"$f":"MATCH(N102,$O$65:INDIRECT(\"$O\"&ROW($J$65)+$H$2-1),1)","v":32},{"$f":"INDEX($K$65:INDIRECT(\"$K\"&ROW($J$65)+$H$2-1),P102)","v":9},{"$f":"INDEX($L$65:INDIRECT(\"$L\"&ROW($J$65)+$H$2-1),P102)","v":1},{"$f":"INDEX($M$65:INDIRECT(\"$M\"&ROW($J$65)+$H$2-1),P102)","v":"rot"}]
[null,null,null,null,null,null,null,null,null,39,8,3,"blau",0.97612940345315002,{"$f":"SMALL($N$65:INDIRECT(\"$N\"&ROW($J$65)+$H$2-1),J103)","v":0.74872326767867803},{"$f":"MATCH(N103,$O$65:INDIRECT(\"$O\"&ROW($J$65)+$H$2-1),1)","v":46},{"$f":"INDEX($K$65:INDIRECT(\"$K\"&ROW($J$65)+$H$2-1),P103)","v":3},{"$f":"INDEX($L$65:INDIRECT(\"$L\"&ROW($J$65)+$H$2-1),P103)","v":1},{"$f":"INDEX($M$65:INDIRECT(\"$M\"&ROW($J$65)+$H$2-1),P103)","v":"rot"}]
[null,null,null,null,null,null,null,null,null,40,8,4,"gelb",0.58357349726612395,{"$f":"SMALL($N$65:INDIRECT(\"$N\"&ROW($J$65)+$H$2-1),J104)","v":0.83751797005789996},{"$f":"MATCH(N104,$O$65:INDIRECT(\"$O\"&ROW($J$65)+$H$2-1),1)","v":29},{"$f":"INDEX($K$65:INDIRECT(\"$K\"&ROW($J$65)+$H$2-1),P104)","v":4},{"$f":"INDEX($L$65:INDIRECT(\"$L\"&ROW($J$65)+$H$2-1),P104)","v":1},{"$f":"INDEX($M$65:INDIRECT(\"$M\"&ROW($J$65)+$H$2-1),P104)","v":"rot"}]
[null,null,null,null,null,null,null,null,null,41,8,1,"rot",0.20223882623266201,{"$f":"SMALL($N$65:INDIRECT(\"$N\"&ROW($J$65)+$H$2-1),J105)","v":0.84408356486903702},{"$f":"MATCH(N105,$O$65:INDIRECT(\"$O\"&ROW($J$65)+$H$2-1),1)","v":9},{"$f":"INDEX($K$65:INDIRECT(\"$K\"&ROW($J$65)+$H$2-1),P105)","v":2},{"$f":"INDEX($L$65:INDIRECT(\"$L\"&ROW($J$65)+$H$2-1),P105)","v":5},{"$f":"INDEX($M$65:INDIRECT(\"$M\"&ROW($J$65)+$H$2-1),P105)","v":"grau"}]
[null,null,null,null,null,null,null,null,null,42,4,3,"blau",0.69619470019395002,{"$f":"SMALL($N$65:INDIRECT(\"$N\"&ROW($J$65)+$H$2-1),J106)","v":0.88894434125301003},{"$f":"MATCH(N106,$O$65:INDIRECT(\"$O\"&ROW($J$65)+$H$2-1),1)","v":35},{"$f":"INDEX($K$65:INDIRECT(\"$K\"&ROW($J$65)+$H$2-1),P106)","v":3},{"$f":"INDEX($L$65:INDIRECT(\"$L\"&ROW($J$65)+$H$2-1),P106)","v":1},{"$f":"INDEX($M$65:INDIRECT(\"$M\"&ROW($J$65)+$H$2-1),P106)","v":"rot"}]
[null,null,null,null,null,null,null,null,null,43,2,1,"rot",0.18954975595620499,{"$f":"SMALL($N$65:INDIRECT(\"$N\"&ROW($J$65)+$H$2-1),J107)","v":0.89950155412110799},{"$f":"MATCH(N107,$O$65:INDIRECT(\"$O\"&ROW($J$65)+$H$2-1),1)","v":7},{"$f":"INDEX($K$65:INDIRECT(\"$K\"&ROW($J$65)+$H$2-1),P107)","v":3},{"$f":"INDEX($L$65:INDIRECT(\"$L\"&ROW($J$65)+$H$2-1),P107)","v":3},{"$f":"INDEX($M$65:INDIRECT(\"$M\"&ROW($J$65)+$H$2-1),P107)","v":"blau"}]
[null,null,null,null,null,null,null,null,null,44,3,2,"grün",0.97777122504862302,{"$f":"SMALL($N$65:INDIRECT(\"$N\"&ROW($J$65)+$H$2-1),J108)","v":0.91621652699648304},{"$f":"MATCH(N108,$O$65:INDIRECT(\"$O\"&ROW($J$65)+$H$2-1),1)","v":47},{"$f":"INDEX($K$65:INDIRECT(\"$K\"&ROW($J$65)+$H$2-1),P108)","v":3},{"$f":"INDEX($L$65:INDIRECT(\"$L\"&ROW($J$65)+$H$2-1),P108)","v":3},{"$f":"INDEX($M$65:INDIRECT(\"$M\"&ROW($J$65)+$H$2-1),P108)","v":"blau"}]
[null,null,null,null,null,null,null,null,null,45,5,5,"grau",0.68829127923190903,{"$f":"SMALL($N$65:INDIRECT(\"$N\"&ROW($J$65)+$H$2-1),J109)","v":0.95584138772021099},{"$f":"MATCH(N109,$O$65:INDIRECT(\"$O\"&ROW($J$65)+$H$2-1),1)","v":33},{"$f":"INDEX($K$65:INDIRECT(\"$K\"&ROW($J$65)+$H$2-1),P109)","v":2},{"$f":"INDEX($L$65:INDIRECT(\"$L\"&ROW($J$65)+$H$2-1),P109)","v":2},{"$f":"INDEX($M$65:INDIRECT(\"$M\"&ROW($J$65)+$H$2-1),P109)","v":"grün"}]
[null,null,null,null,null,null,null,null,null,46,3,1,"rot",0.99916782286660599,{"$f":"SMALL($N$65:INDIRECT(\"$N\"&ROW($J$65)+$H$2-1),J110)","v":0.97612940345315002},{"$f":"MATCH(N110,$O$65:INDIRECT(\"$O\"&ROW($J$65)+$H$2-1),1)","v":49},{"$f":"INDEX($K$65:INDIRECT(\"$K\"&ROW($J$65)+$H$2-1),P110)","v":7},{"$f":"INDEX($L$65:INDIRECT(\"$L\"&ROW($J$65)+$H$2-1),P110)","v":3},{"$f":"INDEX($M$65:INDIRECT(\"$M\"&ROW($J$65)+$H$2-1),P110)","v":"blau"}]
[null,null,null,null,null,null,null,null,null,47,3,3,"blau",0.276642771004598,{"$f":"SMALL($N$65:INDIRECT(\"$N\"&ROW($J$65)+$H$2-1),J111)","v":0.97777122504862302},{"$f":"MATCH(N111,$O$65:INDIRECT(\"$O\"&ROW($J$65)+$H$2-1),1)","v":15},{"$f":"INDEX($K$65:INDIRECT(\"$K\"&ROW($J$65)+$H$2-1),P111)","v":9},{"$f":"INDEX($L$65:INDIRECT(\"$L\"&ROW($J$65)+$H$2-1),P111)","v":5},{"$f":"INDEX($M$65:INDIRECT(\"$M\"&ROW($J$65)+$H$2-1),P111)","v":"grau"}]
[null,null,null,null,null,null,null,null,null,48,3,4,"gelb",0.63066775185579205,{"$f":"SMALL($N$65:INDIRECT(\"$N\"&ROW($J$65)+$H$2-1),J112)","v":0.97991568902993897},{"$f":"MATCH(N112,$O$65:INDIRECT(\"$O\"&ROW($J$65)+$H$2-1),1)","v":30},{"$f":"INDEX($K$65:INDIRECT(\"$K\"&ROW($J$65)+$H$2-1),P112)","v":5},{"$f":"INDEX($L$65:INDIRECT(\"$L\"&ROW($J$65)+$H$2-1),P112)","v":1},{"$f":"INDEX($M$65:INDIRECT(\"$M\"&ROW($J$65)+$H$2-1),P112)","v":"rot"}]
[null,null,null,null,null,null,null,null,null,49,7,3,"blau",0.28952575862171698,{"$f":"SMALL($N$65:INDIRECT(\"$N\"&ROW($J$65)+$H$2-1),J113)","v":0.99916782286660599},{"$f":"MATCH(N113,$O$65:INDIRECT(\"$O\"&ROW($J$65)+$H$2-1),1)","v":16},{"$f":"INDEX($K$65:INDIRECT(\"$K\"&ROW($J$65)+$H$2-1),P113)","v":9},{"$f":"INDEX($L$65:INDIRECT(\"$L\"&ROW($J$65)+$H$2-1),P113)","v":2},{"$f":"INDEX($M$65:INDIRECT(\"$M\"&ROW($J$65)+$H$2-1),P113)","v":"grün"}]

{"sheet":"Ergebnismenge","index":1,"n_rows":340,"n_cols":41,"rows_kept":340,"cut":false,"hidden":false,"merged":[[12,30,13,36],[19,30,25,36]]}
[]
[]
[null,"Gefäß mit Kugeln: ",null,null,null,null,null,null,null,{"$f":"Kugeln!Y54","v":49},"Stück",null,null,null,null,null,null,null,null,null,null,null,null,null,null,null,null,null,null,"3 Varianten zur Festlegung des Zufallsexperiments ( bzw. der Ergebnismenge Ω )",null,null,null,null,null,null,null,null,null,null,false]
[]
[null,{"$f":"Kugeln!Y4","v":7},{"$f":"Kugeln!Z4","v":"grün"},1,null,{"$f":"Kugeln!Y11","v":9},{"$f":"Kugeln!Z11","v":"grün"},8,null,{"$f":"Kugeln!Y18","v":5},{"$f":"Kugeln!Z18","v":"gelb"},15,null,{"$f":"Kugeln!Y25","v":2},{"$f":"Kugeln!Z25","v":"rot"},22,null,{"$f":"Kugeln!Y32","v":6},{"$f":"Kugeln!Z32","v":"rot"},29,null,{"$f":"Kugeln!Y39","v":5},{"$f":"Kugeln!Z39","v":"blau"},36,null,{"$f":"Kugeln!Y46","v":5},{"$f":"Kugeln!Z46","v":"blau"},43,null,"1.  Es wird 1-mal gezogen, Beobachtungskriterium: Farbe"]
[]
[null,{"$f":"Kugeln!Y5","v":8},{"$f":"Kugeln!Z5","v":"grün"},2,null,{"$f":"Kugeln!Y12","v":6},{"$f":"Kugeln!Z12","v":"gelb"},9,null,{"$f":"Kugeln!Y19","v":3},{"$f":"Kugeln!Z19","v":"gelb"},16,null,{"$f":"Kugeln!Y26","v":2},{"$f":"Kugeln!Z26","v":"grau"},23,null,{"$f":"Kugeln!Y33","v":9},{"$f":"Kugeln!Z33","v":"gelb"},30,null,{"$f":"Kugeln!Y40","v":2},{"$f":"Kugeln!Z40","v":"grau"},37,null,{"$f":"Kugeln!Y47","v":6},{"$f":"Kugeln!Z47","v":"grau"},44,null,"Ω   =",{"$f":"CONCATENATE(\"{\",V30,V31,V32,V33,V34,\"}\")","v":"{rot, grün, blau, gelb, grau}"}]
[]
[null,{"$f":"Kugeln!Y6","v":4},{"$f":"Kugeln!Z6","v":"grün"},3,null,{"$f":"Kugeln!Y13","v":7},{"$f":"Kugeln!Z13","v":"gelb"},10,null,{"$f":"Kugeln!Y20","v":7},{"$f":"Kugeln!Z20","v":"rot"},17,null,{"$f":"Kugeln!Y27","v":2},{"$f":"Kugeln!Z27","v":"grün"},24,null,{"$f":"Kugeln!Y34","v":7},{"$f":"Kugeln!Z34","v":"grau"},31,null,{"$f":"Kugeln!Y41","v":9},{"$f":"Kugeln!Z41","v":"grün"},38,null,{"$f":"Kugeln!Y48","v":3},{"$f":"Kugeln!Z48","v":"grün"},45,null,"|Ω| =",{"$f":"G35","v":5}]
[]
[null,{"$f":"Kugeln!Y7","v":2},{"$f":"Kugeln!Z7","v":"grau"},4,null,{"$f":"Kugeln!Y14","v":8},{"$f":"Kugeln!Z14","v":"grün"},11,null,{"$f":"Kugeln!Y21","v":5},{"$f":"Kugeln!Z21","v":"grau"},18,null,{"$f":"Kugeln!Y28","v":5},{"$f":"Kugeln!Z28","v":"grau"},25,null,{"$f":"Kugeln!Y35","v":7},{"$f":"Kugeln!Z35","v":"blau"},32,null,{"$f":"Kugeln!Y42","v":6},{"$f":"Kugeln!Z42","v":"grün"},39,null,{"$f":"Kugeln!Y49","v":6},{"$f":"Kugeln!Z49","v":"grün"},46,null,"2.  Es wird 1-mal gezogen, Beobachtungskriterium: Zahl"]
[]
[null,{"$f":"Kugeln!Y8","v":2},{"$f":"Kugeln!Z8","v":"grün"},5,null,{"$f":"Kugeln!Y15","v":7},{"$f":"Kugeln!Z15","v":"grau"},12,null,{"$f":"Kugeln!Y22","v":2},{"$f":"Kugeln!Z22","v":"blau"},19,null,{"$f":"Kugeln!Y29","v":9},{"$f":"Kugeln!Z29","v":"blau"},26,null,{"$f":"Kugeln!Y36","v":6},{"$f":"Kugeln!Z36","v":"rot"},33,null,{"$f":"Kugeln!Y43","v":8},{"$f":"Kugeln!Z43","v":"rot"},40,null,{"$f":"Kugeln!Y50","v":8},{"$f":"Kugeln!Z50","v":"grau"},47,null,"Ω   =",{"$f":"CONCATENATE(\"{\",V39,V40,V41,V42,V43,V44,V45,V46,V47,V48,V49,V50,V51,V52,V53,V54,V55,V56,V57,V58,V59,V60,V61,V62,V63,V64,V65,V66,V67,V68,V69,V70,V71,V72,V73,V74,V75,V76,V77,V78,V79,V80,V81,V82,V83,V84,V85,V86,V87,\"}\")","v":"{2, 3, 4, 5, 6, 7, 8, 9}"}]
[]
[null,{"$f":"Kugeln!Y9","v":5},{"$f":"Kugeln!Z9","v":"gelb"},6,null,{"$f":"Kugeln!Y16","v":4},{"$f":"Kugeln!Z16","v":"grau"},13,null,{"$f":"Kugeln!Y23","v":9},{"$f":"Kugeln!Z23","v":"gelb"},20,null,{"$f":"Kugeln!Y30","v":4},{"$f":"Kugeln!Z30","v":"grün"},27,null,{"$f":"Kugeln!Y37","v":5},{"$f":"Kugeln!Z37","v":"grün"},34,null,{"$f":"Kugeln!Y44","v":4},{"$f":"Kugeln!Z44","v":"rot"},41,null,{"$f":"Kugeln!Y51","v":4},{"$f":"Kugeln!Z51","v":"gelb"},48]
[null,null,null,null,null,null,null,null,null,null,null,null,null,null,null,null,null,null,null,null,null,null,null,null,null,null,null,null,null,"|Ω| =",{"$f":"G88","v":8}]
[null,{"$f":"Kugeln!Y10","v":8},{"$f":"Kugeln!Z10","v":"blau"},7,null,{"$f":"Kugeln!Y17","v":2},{"$f":"Kugeln!Z17","v":"grau"},14,null,{"$f":"Kugeln!Y24","v":8},{"$f":"Kugeln!Z24","v":"grün"},21,null,{"$f":"Kugeln!Y31","v":3},{"$f":"Kugeln!Z31","v":"grau"},28,null,{"$f":"Kugeln!Y38","v":7},{"$f":"Kugeln!Z38","v":"grün"},35,null,{"$f":"Kugeln!Y45","v":6},{"$f":"Kugeln!Z45","v":"gelb"},42,null,{"$f":"Kugeln!Y52","v":9},{"$f":"Kugeln!Z52","v":"blau"},49]
[null,null,null,null,null,null,null,null,null,null,null,null,null,null,null,null,null,null,null,null,null,null,null,null,null,null,null,null,null,"3.  Es wird 1-mal gezogen, Beobachtungskriterium: Farbe und Zahl"]
[null,null,null,null,false]
[null,null,null,null,null,null,null,null,null,null,null,null,null,null,null,null,null,null,null,null,null,null,null,null,null,null,null,null,null,"Ω   =",{"$f":"CONCATENATE(\"{\",V92,V93,V94,V95,V96,V97,V98,V99,V100,V101,V102,V103,V104,V105,V106,V107,V108,V109,V110,V111,V112,V113,V114,V115,V116,V117,V118,V119,V120,V121,V122,V123,V124,V125,V126,V127,V128,V129,V130,V131,V132,V133,V134,V135,V136,V137,V138,V139,V140,V141,V142,V143,V144,V145,V146,V147,V148,V149,V150,V151,V152,V153,V154,V155,V156,V157,V158,V159,V160,V161,V162,V163,V164,V165,V166,V167,V168,V169,V170,V171,V172,V173,V174,V175,V176,V177,V178,V179,V180,V181,V182,V183,V184,V185,V186,V187,V188,V189,V190,V191,V192,V193,V194,V195,V196,V197,V198,V199,V200,V201,V202,V203,V204,V205,V206,V207,V208,V209,V210,V211,V212,V213,V214,V215,V216,V217,V218,V219,V220,V221,V222,V223,V224,V225,V226,V227,V228,V229,V230,V231,V232,V233,V234,V235,V236,V237,V238,V239,V240,V241,V242,V243,V244,V245,V246,V247,V248,V249,V250,V251,V252,V253,V254,V255,V256,V257,V258,V259,V260,V261,V262,V263,V264,V265,V266,V267,V268,V269,V270,V271,V272,V273,V274,V275,V276,V277,V278,V279,V280,V281,V282,V283,V284,V285,V286,V287,V288,V289,V290,V291,V292,V293,V294,V295,V296,V297,V298,V299,V300,V301,V302,V303,V304,V305,V306,V307,V308,V309,V310,V311,V312,V313,V314,V315,V316,V317,V318,V319,V320,V321,V322,V323,V324,V325,V326,V327,V328,V329,V330,V331,V332,V333,V334,V335,V336,\"}\")","v":"{(rot, 2), (rot, 4), (rot, 6), (rot, 7), (rot, 8), (grün, 2), (grün, 3), (grün, 4), (grün, 5), (grün, 6), (grün, 7), (grün, 8), (grün, 9), (blau, 2), (blau, 5), (blau, 7), (blau, 8), (blau, 9), (gelb, 3), (gelb, 4), (gelb, 5), (gelb, 6), (gelb, 7), (gelb, 9), (grau, 2), (grau, 3), (grau, 4), (grau, 5), (grau, 6), (grau, 7), (grau, 8)}"}]
[]
[]
[]
[]
[]
[]
[null,null,null,null,null,null,null,null,null,null,null,null,null,null,null,null,null,null,null,null,null,null,null,null,null,null,null,null,null,"|Ω| =",{"$f":"G340","v":31}]
[null,"Anzahl Farben:"]
[]
[null,null,"rot",null,null,null,{"$f":"COUNTIF(Kugeln!$Y$4:$Z$52,Ergebnismenge!C30)","v":6},null,null,null,null,null,null,null,{"$f":"IF(G30>0,C30,\"\")","v":"rot"},null,null,null,null,null,null,{"$f":"CONCATENATE(N30,O30)","v":"rot"}]
[null,null,"grün",null,null,null,{"$f":"COUNTIF(Kugeln!$Y$4:$Z$52,Ergebnismenge!C31)","v":15},null,null,null,null,null,null,{"$f":"IF(AND(SUM($G$30:G30)>0,G31>0),\", \",\"\")","v":", "},{"$f":"IF(G31>0,C31,\"\")","v":"grün"},null,null,null,null,null,null,{"$f":"CONCATENATE(N31,O31)","v":", grün"}]
[null,null,"blau",null,null,null,{"$f":"COUNTIF(Kugeln!$Y$4:$Z$52,Ergebnismenge!C32)","v":7},null,null,null,null,null,null,{"$f":"IF(AND(SUM($G$30:G31)>0,G32>0),\", \",\"\")","v":", "},{"$f":"IF(G32>0,C32,\"\")","v":"blau"},null,null,null,null,null,null,", blau"]
[null,null,"gelb",null,null,null,{"$f":"COUNTIF(Kugeln!$Y$4:$Z$52,Ergebnismenge!C33)","v":9},null,null,null,null,null,null,{"$f":"IF(AND(SUM($G$30:G32)>0,G33>0),\", \",\"\")","v":", "},{"$f":"IF(G33>0,C33,\"\")","v":"gelb"},null,null,null,null,null,null,", gelb"]
[null,null,"grau",null,null,null,{"$f":"COUNTIF(Kugeln!$Y$4:$Z$52,Ergebnismenge!C34)","v":12},null,null,null,null,null,null,{"$f":"IF(AND(SUM($G$30:G33)>0,G34>0),\", \",\"\")","v":", "},{"$f":"IF(G34>0,C34,\"\")","v":"grau"},null,null,null,null,null,null,", grau"]
[null,null,"|Ω| =",null,null,null,{"$f":"COUNTIF(G30:G34,\">0\")","v":5}]
[]
[null,"Anzahl Zahlen:"]
[]
[null,null,1,null,null,null,{"$f":"COUNTIF(Kugeln!$Y$4:$Z$52,Ergebnismenge!C39)","v":0},null,null,null,null,null,null,null,{"$f":"IF(G39>0,C39,\"\")","v":""},null,null,null,null,null,null,""]
[null,null,2,null,null,null,{"$f":"COUNTIF(Kugeln!$Y$4:$Z$52,Ergebnismenge!C40)","v":8},null,null,null,null,null,null,{"$f":"IF(AND(SUM($G$39:G39)>0,G40>0),\", \",\"\")","v":""},2,null,null,null,null,null,null,"2"]
[null,null,3,null,null,null,{"$f":"COUNTIF(Kugeln!$Y$4:$Z$52,Ergebnismenge!C41)","v":3},null,null,null,null,null,null,{"$f":"IF(AND(SUM($G$39:G40)>0,G41>0),\", \",\"\")","v":", "},3,null,null,null,null,null,null,", 3"]
[null,null,4,null,null,null,{"$f":"COUNTIF(Kugeln!$Y$4:$Z$52,Ergebnismenge!C42)","v":5},null,null,null,null,null,null,{"$f":"IF(AND(SUM($G$39:G41)>0,G42>0),\", \",\"\")","v":", "},4,null,null,null,null,null,null,", 4"]
[null,null,5,null,null,null,{"$f":"COUNTIF(Kugeln!$Y$4:$Z$52,Ergebnismenge!C43)","v":7},null,null,null,null,null,null,{"$f":"IF(AND(SUM($G$39:G42)>0,G43>0),\", \",\"\")","v":", "},5,null,null,null,null,null,null,", 5"]
[null,null,6,null,null,null,{"$f":"COUNTIF(Kugeln!$Y$4:$Z$52,Ergebnismenge!C44)","v":7},null,null,null,null,null,null,{"$f":"IF(AND(SUM($G$39:G43)>0,G44>0),\", \",\"\")","v":", "},6,null,null,null,null,null,null,", 6"]
[null,null,7,null,null,null,{"$f":"COUNTIF(Kugeln!$Y$4:$Z$52,Ergebnismenge!C45)","v":7},null,null,null,null,null,null,{"$f":"IF(AND(SUM($G$39:G44)>0,G45>0),\", \",\"\")","v":", "},7,null,null,null,null,null,null,", 7"]
[null,null,8,null,null,null,{"$f":"COUNTIF(Kugeln!$Y$4:$Z$52,Ergebnismenge!C46)","v":6},null,null,null,null,null,null,{"$f":"IF(AND(SUM($G$39:G45)>0,G46>0),\", \",\"\")","v":", "},8,null,null,null,null,null,null,", 8"]
[null,null,9,null,null,null,{"$f":"COUNTIF(Kugeln!$Y$4:$Z$52,Ergebnismenge!C47)","v":6},null,null,null,null,null,null,{"$f":"IF(AND(SUM($G$39:G46)>0,G47>0),\", \",\"\")","v":", "},9,null,null,null,null,null,null,", 9"]
[null,null,10,null,null,null,{"$f":"COUNTIF(Kugeln!$Y$4:$Z$52,Ergebnismenge!C48)","v":0},null,null,null,null,null,null,{"$f":"IF(AND(SUM($G$39:G47)>0,G48>0),\", \",\"\")","v":""},"",null,null,null,null,null,null,""]
[null,null,11,null,null,null,{"$f":"COUNTIF(Kugeln!$Y$4:$Z$52,Ergebnismenge!C49)","v":0},null,null,null,null,null,null,{"$f":"IF(AND(SUM($G$39:G48)>0,G49>0),\", \",\"\")","v":""},"",null,null,null,null,null,null,""]
[null,null,12,null,null,null,{"$f":"COUNTIF(Kugeln!$Y$4:$Z$52,Ergebnismenge!C50)","v":0},null,null,null,null,null,null,{"$f":"IF(AND(SUM($G$39:G49)>0,G50>0),\", \",\"\")","v":""},"",null,null,null,null,null,null,""]
[null,null,13,null,null,null,{"$f":"COUNTIF(Kugeln!$Y$4:$Z$52,Ergebnismenge!C51)","v":0},null,null,null,null,null,null,{"$f":"IF(AND(SUM($G$39:G50)>0,G51>0),\", \",\"\")","v":""},"",null,null,null,null,null,null,""]
[null,null,14,null,null,null,{"$f":"COUNTIF(Kugeln!$Y$4:$Z$52,Ergebnismenge!C52)","v":0},null,null,null,null,null,null,{"$f":"IF(AND(SUM($G$39:G51)>0,G52>0),\", \",\"\")","v":""},"",null,null,null,null,null,null,""]
[null,null,15,null,null,null,{"$f":"COUNTIF(Kugeln!$Y$4:$Z$52,Ergebnismenge!C53)","v":0},null,null,null,null,null,null,{"$f":"IF(AND(SUM($G$39:G52)>0,G53>0),\", \",\"\")","v":""},"",null,null,null,null,null,null,""]
[null,null,16,null,null,null,{"$f":"COUNTIF(Kugeln!$Y$4:$Z$52,Ergebnismenge!C54)","v":0},null,null,null,null,null,null,{"$f":"IF(AND(SUM($G$39:G53)>0,G54>0),\", \",\"\")","v":""},"",null,null,null,null,null,null,""]
[null,null,17,null,null,null,{"$f":"COUNTIF(Kugeln!$Y$4:$Z$52,Ergebnismenge!C55)","v":0},null,null,null,null,null,null,{"$f":"IF(AND(SUM($G$39:G54)>0,G55>0),\", \",\"\")","v":""},"",null,null,null,null,null,null,""]
[null,null,18,null,null,null,{"$f":"COUNTIF(Kugeln!$Y$4:$Z$52,Ergebnismenge!C56)","v":0},null,null,null,null,null,null,{"$f":"IF(AND(SUM($G$39:G55)>0,G56>0),\", \",\"\")","v":""},"",null,null,null,null,null,null,""]
[null,null,19,null,null,null,{"$f":"COUNTIF(Kugeln!$Y$4:$Z$52,Ergebnismenge!C57)","v":0},null,null,null,null,null,null,{"$f":"IF(AND(SUM($G$39:G56)>0,G57>0),\", \",\"\")","v":""},"",null,null,null,null,null,null,""]
[null,null,20,null,null,null,{"$f":"COUNTIF(Kugeln!$Y$4:$Z$52,Ergebnismenge!C58)","v":0},null,null,null,null,null,null,{"$f":"IF(AND(SUM($G$39:G57)>0,G58>0),\", \",\"\")","v":""},"",null,null,null,null,null,null,""]
[null,null,21,null,null,null,{"$f":"COUNTIF(Kugeln!$Y$4:$Z$52,Ergebnismenge!C59)","v":0},null,null,null,null,null,null,{"$f":"IF(AND(SUM($G$39:G58)>0,G59>0),\", \",\"\")","v":""},"",null,null,null,null,null,null,""]
[null,null,22,null,null,null,{"$f":"COUNTIF(Kugeln!$Y$4:$Z$52,Ergebnismenge!C60)","v":0},null,null,null,null,null,null,{"$f":"IF(AND(SUM($G$39:G59)>0,G60>0),\", \",\"\")","v":""},"",null,null,null,null,null,null,""]
[null,null,23,null,null,null,{"$f":"COUNTIF(Kugeln!$Y$4:$Z$52,Ergebnismenge!C61)","v":0},null,null,null,null,null,null,{"$f":"IF(AND(SUM($G$39:G60)>0,G61>0),\", \",\"\")","v":""},"",null,null,null,null,null,null,""]
[null,null,24,null,null,null,{"$f":"COUNTIF(Kugeln!$Y$4:$Z$52,Ergebnismenge!C62)","v":0},null,null,null,null,null,null,{"$f":"IF(AND(SUM($G$39:G61)>0,G62>0),\", \",\"\")","v":""},"",null,null,null,null,null,null,""]
[null,null,25,null,null,null,{"$f":"COUNTIF(Kugeln!$Y$4:$Z$52,Ergebnismenge!C63)","v":0},null,null,null,null,null,null,{"$f":"IF(AND(SUM($G$39:G62)>0,G63>0),\", \",\"\")","v":""},"",null,null,null,null,null,null,""]
[null,null,26,null,null,null,{"$f":"COUNTIF(Kugeln!$Y$4:$Z$52,Ergebnismenge!C64)","v":0},null,null,null,null,null,null,{"$f":"IF(AND(SUM($G$39:G63)>0,G64>0),\", \",\"\")","v":""},"",null,null,null,null,null,null,""]
[null,null,27,null,null,null,{"$f":"COUNTIF(Kugeln!$Y$4:$Z$52,Ergebnismenge!C65)","v":0},null,null,null,null,null,null,{"$f":"IF(AND(SUM($G$39:G64)>0,G65>0),\", \",\"\")","v":""},"",null,null,null,null,null,null,""]
[null,null,28,null,null,null,{"$f":"COUNTIF(Kugeln!$Y$4:$Z$52,Ergebnismenge!C66)","v":0},null,null,null,null,null,null,{"$f":"IF(AND(SUM($G$39:G65)>0,G66>0),\", \",\"\")","v":""},"",null,null,null,null,null,null,""]
[null,null,29,null,null,null,{"$f":"COUNTIF(Kugeln!$Y$4:$Z$52,Ergebnismenge!C67)","v":0},null,null,null,null,null,null,{"$f":"IF(AND(SUM($G$39:G66)>0,G67>0),\", \",\"\")","v":""},"",null,null,null,null,null,null,""]
[null,null,30,null,null,null,{"$f":"COUNTIF(Kugeln!$Y$4:$Z$52,Ergebnismenge!C68)","v":0},null,null,null,null,null,null,{"$f":"IF(AND(SUM($G$39:G67)>0,G68>0),\", \",\"\")","v":""},"",null,null,null,null,null,null,""]
[null,null,31,null,null,null,{"$f":"COUNTIF(Kugeln!$Y$4:$Z$52,Ergebnismenge!C69)","v":0},null,null,null,null,null,null,{"$f":"IF(AND(SUM($G$39:G68)>0,G69>0),\", \",\"\")","v":""},"",null,null,null,null,null,null,""]
[null,null,32,null,null,null,{"$f":"COUNTIF(Kugeln!$Y$4:$Z$52,Ergebnismenge!C70)","v":0},null,null,null,null,null,null,{"$f":"IF(AND(SUM($G$39:G69)>0,G70>0),\", \",\"\")","v":""},"",null,null,null,null,null,null,""]
[null,null,33,null,null,null,{"$f":"COUNTIF(Kugeln!$Y$4:$Z$52,Ergebnismenge!C71)","v":0},null,null,null,null,null,null,{"$f":"IF(AND(SUM($G$39:G70)>0,G71>0),\", \",\"\")","v":""},{"$f":"IF(G71>0,C71,\"\")","v":""},null,null,null,null,null,null,""]
[null,null,34,null,null,null,{"$f":"COUNTIF(Kugeln!$Y$4:$Z$52,Ergebnismenge!C72)","v":0},null,null,null,null,null,null,{"$f":"IF(AND(SUM($G$39:G71)>0,G72>0),\", \",\"\")","v":""},"",null,null,null,null,null,null,""]
[null,null,35,null,null,null,{"$f":"COUNTIF(Kugeln!$Y$4:$Z$52,Ergebnismenge!C73)","v":0},null,null,null,null,null,null,{"$f":"IF(AND(SUM($G$39:G72)>0,G73>0),\", \",\"\")","v":""},"",null,null,null,null,null,null,""]
[null,null,36,null,null,null,{"$f":"COUNTIF(Kugeln!$Y$4:$Z$52,Ergebnismenge!C74)","v":0},null,null,null,null,null,null,{"$f":"IF(AND(SUM($G$39:G73)>0,G74>0),\", \",\"\")","v":""},"",null,null,null,null,null,null,""]
[null,null,37,null,null,null,{"$f":"COUNTIF(Kugeln!$Y$4:$Z$52,Ergebnismenge!C75)","v":0},null,null,null,null,null,null,{"$f":"IF(AND(SUM($G$39:G74)>0,G75>0),\", \",\"\")","v":""},"",null,null,null,null,null,null,""]
[null,null,38,null,null,null,{"$f":"COUNTIF(Kugeln!$Y$4:$Z$52,Ergebnismenge!C76)","v":0},null,null,null,null,null,null,{"$f":"IF(AND(SUM($G$39:G75)>0,G76>0),\", \",\"\")","v":""},"",null,null,null,null,null,null,""]
[null,null,39,null,null,null,{"$f":"COUNTIF(Kugeln!$Y$4:$Z$52,Ergebnismenge!C77)","v":0},null,null,null,null,null,null,{"$f":"IF(AND(SUM($G$39:G76)>0,G77>0),\", \",\"\")","v":""},"",null,null,null,null,null,null,""]
[null,null,40,null,null,null,{"$f":"COUNTIF(Kugeln!$Y$4:$Z$52,Ergebnismenge!C78)","v":0},null,null,null,null,null,null,{"$f":"IF(AND(SUM($G$39:G77)>0,G78>0),\", \",\"\")","v":""},"",null,null,null,null,null,null,""]
[null,null,41,null,null,null,{"$f":"COUNTIF(Kugeln!$Y$4:$Z$52,Ergebnismenge!C79)","v":0},null,null,null,null,null,null,{"$f":"IF(AND(SUM($G$39:G78)>0,G79>0),\", \",\"\")","v":""},"",null,null,null,null,null,null,""]
[null,null,42,null,null,null,{"$f":"COUNTIF(Kugeln!$Y$4:$Z$52,Ergebnismenge!C80)","v":0},null,null,null,null,null,null,{"$f":"IF(AND(SUM($G$39:G79)>0,G80>0),\", \",\"\")","v":""},"",null,null,null,null,null,null,""]
[null,null,43,null,null,null,{"$f":"COUNTIF(Kugeln!$Y$4:$Z$52,Ergebnismenge!C81)","v":0},null,null,null,null,null,null,{"$f":"IF(AND(SUM($G$39:G80)>0,G81>0),\", \",\"\")","v":""},"",null,null,null,null,null,null,""]
[null,null,44,null,null,null,{"$f":"COUNTIF(Kugeln!$Y$4:$Z$52,Ergebnismenge!C82)","v":0},null,null,null,null,null,null,{"$f":"IF(AND(SUM($G$39:G81)>0,G82>0),\", \",\"\")","v":""},"",null,null,null,null,null,null,""]
[null,null,45,null,null,null,{"$f":"COUNTIF(Kugeln!$Y$4:$Z$52,Ergebnismenge!C83)","v":0},null,null,null,null,null,null,{"$f":"IF(AND(SUM($G$39:G82)>0,G83>0),\", \",\"\")","v":""},"",null,null,null,null,null,null,""]
[null,null,46,null,null,null,{"$f":"COUNTIF(Kugeln!$Y$4:$Z$52,Ergebnismenge!C84)","v":0},null,null,null,null,null,null,{"$f":"IF(AND(SUM($G$39:G83)>0,G84>0),\", \",\"\")","v":""},"",null,null,null,null,null,null,""]
[null,null,47,null,null,null,{"$f":"COUNTIF(Kugeln!$Y$4:$Z$52,Ergebnismenge!C85)","v":0},null,null,null,null,null,null,{"$f":"IF(AND(SUM($G$39:G84)>0,G85>0),\", \",\"\")","v":""},"",null,null,null,null,null,null,""]
[null,null,48,null,null,null,{"$f":"COUNTIF(Kugeln!$Y$4:$Z$52,Ergebnismenge!C86)","v":0},null,null,null,null,null,null,{"$f":"IF(AND(SUM($G$39:G85)>0,G86>0),\", \",\"\")","v":""},"",null,null,null,null,null,null,""]
[null,null,49,null,null,null,{"$f":"COUNTIF(Kugeln!$Y$4:$Z$52,Ergebnismenge!C87)","v":0},null,null,null,null,null,null,{"$f":"IF(AND(SUM($G$39:G86)>0,G87>0),\", \",\"\")","v":""},"",null,null,null,null,null,null,""]
[null,null,"|Ω| =",null,null,null,{"$f":"COUNTIF(G39:G87,\">0\")","v":8}]
[]
[null,"Anzahl (Zahl, Farbe):"]
[]
[null,null,1,null,null,"rot",{"$f":"COUNTIF(Kugeln!$X$4:$X$52,CONCATENATE(\"(\",Ergebnismenge!C92,\", \",F92,\")\"))","v":0},null,null,null,null,null,null,null,{"$f":"IF(G92>0,CONCATENATE(\"(\",F92,\", \",C92,\")\"),\"\")","v":""},null,null,null,null,null,null,""]
[null,null,2,null,null,"rot",{"$f":"COUNTIF(Kugeln!$X$4:$X$52,CONCATENATE(\"(\",Ergebnismenge!C93,\", \",F93,\")\"))","v":1},null,null,null,null,null,null,{"$f":"IF(AND(SUM($G$92:G92)>0,G93>0),\", \",\"\")","v":""},"(rot, 2)",null,null,null,null,null,null,"(rot, 2)"]
[null,null,3,null,null,"rot",{"$f":"COUNTIF(Kugeln!$X$4:$X$52,CONCATENATE(\"(\",Ergebnismenge!C94,\", \",F94,\")\"))","v":0},null,null,null,null,null,null,{"$f":"IF(AND(SUM($G$92:G93)>0,G94>0),\", \",\"\")","v":""},{"$f":"IF(G94>0,CONCATENATE(\"(\",F94,\", \",C94,\")\"),\"\")","v":""},null,null,null,null,null,null,""]
[null,null,4,null,null,"rot",{"$f":"COUNTIF(Kugeln!$X$4:$X$52,CONCATENATE(\"(\",Ergebnismenge!C95,\", \",F95,\")\"))","v":1},null,null,null,null,null,null,{"$f":"IF(AND(SUM($G$92:G94)>0,G95>0),\", \",\"\")","v":", "},{"$f":"IF(G95>0,CONCATENATE(\"(\",F95,\", \",C95,\")\"),\"\")","v":"(rot, 4)"},null,null,null,null,null,null,", (rot, 4)"]
[null,null,5,null,null,"rot",{"$f":"COUNTIF(Kugeln!$X$4:$X$52,CONCATENATE(\"(\",Ergebnismenge!C96,\", \",F96,\")\"))","v":0},null,null,null,null,null,null,{"$f":"IF(AND(SUM($G$92:G95)>0,G96>0),\", \",\"\")","v":""},"",null,null,null,null,null,null,""]
[null,null,6,null,null,"rot",{"$f":"COUNTIF(Kugeln!$X$4:$X$52,CONCATENATE(\"(\",Ergebnismenge!C97,\", \",F97,\")\"))","v":2},null,null,null,null,null,null,{"$f":"IF(AND(SUM($G$92:G96)>0,G97>0),\", \",\"\")","v":", "},"(rot, 6)",null,null,null,null,null,null,{"$f":"CONCATENATE(N97,O97)","v":", (rot, 6)"}]
[null,null,7,null,null,"rot",{"$f":"COUNTIF(Kugeln!$X$4:$X$52,CONCATENATE(\"(\",Ergebnismenge!C98,\", \",F98,\")\"))","v":1},null,null,null,null,null,null,{"$f":"IF(AND(SUM($G$92:G97)>0,G98>0),\", \",\"\")","v":", "},"(rot, 7)",null,null,null,null,null,null,", (rot, 7)"]
[null,null,8,null,null,"rot",{"$f":"COUNTIF(Kugeln!$X$4:$X$52,CONCATENATE(\"(\",Ergebnismenge!C99,\", \",F99,\")\"))","v":1},null,null,null,null,null,null,{"$f":"IF(AND(SUM($G$92:G98)>0,G99>0),\", \",\"\")","v":", "},"(rot, 8)",null,null,null,null,null,null,", (rot, 8)"]
[null,null,9,null,null,"rot",{"$f":"COUNTIF(Kugeln!$X$4:$X$52,CONCATENATE(\"(\",Ergebnismenge!C100,\", \",F100,\")\"))","v":0},null,null,null,null,null,null,{"$f":"IF(AND(SUM($G$92:G99)>0,G100>0),\", \",\"\")","v":""},"",null,null,null,null,null,null,""]
[null,null,10,null,null,"rot",{"$f":"COUNTIF(Kugeln!$X$4:$X$52,CONCATENATE(\"(\",Ergebnismenge!C101,\", \",F101,\")\"))","v":0},null,null,null,null,null,null,{"$f":"IF(AND(SUM($G$92:G100)>0,G101>0),\", \",\"\")","v":""},"",null,null,null,null,null,null,""]
[null,null,11,null,null,"rot",{"$f":"COUNTIF(Kugeln!$X$4:$X$52,CONCATENATE(\"(\",Ergebnismenge!C102,\", \",F102,\")\"))","v":0},null,null,null,null,null,null,{"$f":"IF(AND(SUM($G$92:G101)>0,G102>0),\", \",\"\")","v":""},"",null,null,null,null,null,null,""]
[null,null,12,null,null,"rot",{"$f":"COUNTIF(Kugeln!$X$4:$X$52,CONCATENATE(\"(\",Ergebnismenge!C103,\", \",F103,\")\"))","v":0},null,null,null,null,null,null,{"$f":"IF(AND(SUM($G$92:G102)>0,G103>0),\", \",\"\")","v":""},"",null,null,null,null,null,null,""]
[null,null,13,null,null,"rot",{"$f":"COUNTIF(Kugeln!$X$4:$X$52,CONCATENATE(\"(\",Ergebnismenge!C104,\", \",F104,\")\"))","v":0},null,null,null,null,null,null,{"$f":"IF(AND(SUM($G$92:G103)>0,G104>0),\", \",\"\")","v":""},"",null,null,null,null,null,null,""]
[null,null,14,null,null,"rot",{"$f":"COUNTIF(Kugeln!$X$4:$X$52,CONCATENATE(\"(\",Ergebnismenge!C105,\", \",F105,\")\"))","v":0},null,null,null,null,null,null,{"$f":"IF(AND(SUM($G$92:G104)>0,G105>0),\", \",\"\")","v":""},"",null,null,null,null,null,null,""]
[null,null,15,null,null,"rot",{"$f":"COUNTIF(Kugeln!$X$4:$X$52,CONCATENATE(\"(\",Ergebnismenge!C106,\", \",F106,\")\"))","v":0},null,null,null,null,null,null,{"$f":"IF(AND(SUM($G$92:G105)>0,G106>0),\", \",\"\")","v":""},"",null,null,null,null,null,null,""]
[null,null,16,null,null,"rot",{"$f":"COUNTIF(Kugeln!$X$4:$X$52,CONCATENATE(\"(\",Ergebnismenge!C107,\", \",F107,\")\"))","v":0},null,null,null,null,null,null,{"$f":"IF(AND(SUM($G$92:G106)>0,G107>0),\", \",\"\")","v":""},"",null,null,null,null,null,null,""]
[null,null,17,null,null,"rot",{"$f":"COUNTIF(Kugeln!$X$4:$X$52,CONCATENATE(\"(\",Ergebnismenge!C108,\", \",F108,\")\"))","v":0},null,null,null,null,null,null,{"$f":"IF(AND(SUM($G$92:G107)>0,G108>0),\", \",\"\")","v":""},"",null,null,null,null,null,null,""]
[null,null,18,null,null,"rot",{"$f":"COUNTIF(Kugeln!$X$4:$X$52,CONCATENATE(\"(\",Ergebnismenge!C109,\", \",F109,\")\"))","v":0},null,null,null,null,null,null,{"$f":"IF(AND(SUM($G$92:G108)>0,G109>0),\", \",\"\")","v":""},"",null,null,null,null,null,null,""]
[null,null,19,null,null,"rot",{"$f":"COUNTIF(Kugeln!$X$4:$X$52,CONCATENATE(\"(\",Ergebnismenge!C110,\", \",F110,\")\"))","v":0},null,null,null,null,null,null,{"$f":"IF(AND(SUM($G$92:G109)>0,G110>0),\", \",\"\")","v":""},"",null,null,null,null,null,null,""]
[null,null,20,null,null,"rot",{"$f":"COUNTIF(Kugeln!$X$4:$X$52,CONCATENATE(\"(\",Ergebnismenge!C111,\", \",F111,\")\"))","v":0},null,null,null,null,null,null,{"$f":"IF(AND(SUM($G$92:G110)>0,G111>0),\", \",\"\")","v":""},"",null,null,null,null,null,null,""]
[null,null,21,null,null,"rot",{"$f":"COUNTIF(Kugeln!$X$4:$X$52,CONCATENATE(\"(\",Ergebnismenge!C112,\", \",F112,\")\"))","v":0},null,null,null,null,null,null,{"$f":"IF(AND(SUM($G$92:G111)>0,G112>0),\", \",\"\")","v":""},"",null,null,null,null,null,null,""]
[null,null,22,null,null,"rot",{"$f":"COUNTIF(Kugeln!$X$4:$X$52,CONCATENATE(\"(\",Ergebnismenge!C113,\", \",F113,\")\"))","v":0},null,null,null,null,null,null,{"$f":"IF(AND(SUM($G$92:G112)>0,G113>0),\", \",\"\")","v":""},"",null,null,null,null,null,null,""]
[null,null,23,null,null,"rot",{"$f":"COUNTIF(Kugeln!$X$4:$X$52,CONCATENATE(\"(\",Ergebnismenge!C114,\", \",F114,\")\"))","v":0},null,null,null,null,null,null,{"$f":"IF(AND(SUM($G$92:G113)>0,G114>0),\", \",\"\")","v":""},"",null,null,null,null,null,null,""]
[null,null,24,null,null,"rot",{"$f":"COUNTIF(Kugeln!$X$4:$X$52,CONCATENATE(\"(\",Ergebnismenge!C115,\", \",F115,\")\"))","v":0},null,null,null,null,null,null,{"$f":"IF(AND(SUM($G$92:G114)>0,G115>0),\", \",\"\")","v":""},"",null,null,null,null,null,null,""]
[null,null,25,null,null,"rot",{"$f":"COUNTIF(Kugeln!$X$4:$X$52,CONCATENATE(\"(\",Ergebnismenge!C116,\", \",F116,\")\"))","v":0},null,null,null,null,null,null,{"$f":"IF(AND(SUM($G$92:G115)>0,G116>0),\", \",\"\")","v":""},"",null,null,null,null,null,null,""]
[null,null,26,null,null,"rot",{"$f":"COUNTIF(Kugeln!$X$4:$X$52,CONCATENATE(\"(\",Ergebnismenge!C117,\", \",F117,\")\"))","v":0},null,null,null,null,null,null,{"$f":"IF(AND(SUM($G$92:G116)>0,G117>0),\", \",\"\")","v":""},"",null,null,null,null,null,null,""]
[null,null,27,null,null,"rot",{"$f":"COUNTIF(Kugeln!$X$4:$X$52,CONCATENATE(\"(\",Ergebnismenge!C118,\", \",F118,\")\"))","v":0},null,null,null,null,null,null,{"$f":"IF(AND(SUM($G$92:G117)>0,G118>0),\", \",\"\")","v":""},"",null,null,null,null,null,null,""]
[null,null,28,null,null,"rot",{"$f":"COUNTIF(Kugeln!$X$4:$X$52,CONCATENATE(\"(\",Ergebnismenge!C119,\", \",F119,\")\"))","v":0},null,null,null,null,null,null,{"$f":"IF(AND(SUM($G$92:G118)>0,G119>0),\", \",\"\")","v":""},"",null,null,null,null,null,null,""]
[null,null,29,null,null,"rot",{"$f":"COUNTIF(Kugeln!$X$4:$X$52,CONCATENATE(\"(\",Ergebnismenge!C120,\", \",F120,\")\"))","v":0},null,null,null,null,null,null,{"$f":"IF(AND(SUM($G$92:G119)>0,G120>0),\", \",\"\")","v":""},"",null,null,null,null,null,null,""]
[null,null,30,null,null,"rot",{"$f":"COUNTIF(Kugeln!$X$4:$X$52,CONCATENATE(\"(\",Ergebnismenge!C121,\", \",F121,\")\"))","v":0},null,null,null,null,null,null,{"$f":"IF(AND(SUM($G$92:G120)>0,G121>0),\", \",\"\")","v":""},"",null,null,null,null,null,null,""]
[null,null,31,null,null,"rot",{"$f":"COUNTIF(Kugeln!$X$4:$X$52,CONCATENATE(\"(\",Ergebnismenge!C122,\", \",F122,\")\"))","v":0},null,null,null,null,null,null,{"$f":"IF(AND(SUM($G$92:G121)>0,G122>0),\", \",\"\")","v":""},"",null,null,null,null,null,null,""]
[null,null,32,null,null,"rot",{"$f":"COUNTIF(Kugeln!$X$4:$X$52,CONCATENATE(\"(\",Ergebnismenge!C123,\", \",F123,\")\"))","v":0},null,null,null,null,null,null,{"$f":"IF(AND(SUM($G$92:G122)>0,G123>0),\", \",\"\")","v":""},"",null,null,null,null,null,null,""]
[null,null,33,null,null,"rot",{"$f":"COUNTIF(Kugeln!$X$4:$X$52,CONCATENATE(\"(\",Ergebnismenge!C124,\", \",F124,\")\"))","v":0},null,null,null,null,null,null,{"$f":"IF(AND(SUM($G$92:G123)>0,G124>0),\", \",\"\")","v":""},"",null,null,null,null,null,null,""]
[null,null,34,null,null,"rot",{"$f":"COUNTIF(Kugeln!$X$4:$X$52,CONCATENATE(\"(\",Ergebnismenge!C125,\", \",F125,\")\"))","v":0},null,null,null,null,null,null,{"$f":"IF(AND(SUM($G$92:G124)>0,G125>0),\", \",\"\")","v":""},"",null,null,null,null,null,null,""]
[null,null,35,null,null,"rot",{"$f":"COUNTIF(Kugeln!$X$4:$X$52,CONCATENATE(\"(\",Ergebnismenge!C126,\", \",F126,\")\"))","v":0},null,null,null,null,null,null,{"$f":"IF(AND(SUM($G$92:G125)>0,G126>0),\", \",\"\")","v":""},"",null,null,null,null,null,null,""]
[null,null,36,null,null,"rot",{"$f":"COUNTIF(Kugeln!$X$4:$X$52,CONCATENATE(\"(\",Ergebnismenge!C127,\", \",F127,\")\"))","v":0},null,null,null,null,null,null,{"$f":"IF(AND(SUM($G$92:G126)>0,G127>0),\", \",\"\")","v":""},"",null,null,null,null,null,null,""]
[null,null,37,null,null,"rot",{"$f":"COUNTIF(Kugeln!$X$4:$X$52,CONCATENATE(\"(\",Ergebnismenge!C128,\", \",F128,\")\"))","v":0},null,null,null,null,null,null,{"$f":"IF(AND(SUM($G$92:G127)>0,G128>0),\", \",\"\")","v":""},"",null,null,null,null,null,null,""]
[null,null,38,null,null,"rot",{"$f":"COUNTIF(Kugeln!$X$4:$X$52,CONCATENATE(\"(\",Ergebnismenge!C129,\", \",F129,\")\"))","v":0},null,null,null,null,null,null,{"$f":"IF(AND(SUM($G$92:G128)>0,G129>0),\", \",\"\")","v":""},"",null,null,null,null,null,null,""]
[null,null,39,null,null,"rot",{"$f":"COUNTIF(Kugeln!$X$4:$X$52,CONCATENATE(\"(\",Ergebnismenge!C130,\", \",F130,\")\"))","v":0},null,null,null,null,null,null,{"$f":"IF(AND(SUM($G$92:G129)>0,G130>0),\", \",\"\")","v":""},"",null,null,null,null,null,null,""]
[null,null,40,null,null,"rot",{"$f":"COUNTIF(Kugeln!$X$4:$X$52,CONCATENATE(\"(\",Ergebnismenge!C131,\", \",F131,\")\"))","v":0},null,null,null,null,null,null,{"$f":"IF(AND(SUM($G$92:G130)>0,G131>0),\", \",\"\")","v":""},"",null,null,null,null,null,null,""]
[null,null,41,null,null,"rot",{"$f":"COUNTIF(Kugeln!$X$4:$X$52,CONCATENATE(\"(\",Ergebnismenge!C132,\", \",F132,\")\"))","v":0},null,null,null,null,null,null,{"$f":"IF(AND(SUM($G$92:G131)>0,G132>0),\", \",\"\")","v":""},"",null,null,null,null,null,null,""]
[null,null,42,null,null,"rot",{"$f":"COUNTIF(Kugeln!$X$4:$X$52,CONCATENATE(\"(\",Ergebnismenge!C133,\", \",F133,\")\"))","v":0},null,null,null,null,null,null,{"$f":"IF(AND(SUM($G$92:G132)>0,G133>0),\", \",\"\")","v":""},"",null,null,null,null,null,null,""]
[null,null,43,null,null,"rot",{"$f":"COUNTIF(Kugeln!$X$4:$X$52,CONCATENATE(\"(\",Ergebnismenge!C134,\", \",F134,\")\"))","v":0},null,null,null,null,null,null,{"$f":"IF(AND(SUM($G$92:G133)>0,G134>0),\", \",\"\")","v":""},"",null,null,null,null,null,null,""]
[null,null,44,null,null,"rot",{"$f":"COUNTIF(Kugeln!$X$4:$X$52,CONCATENATE(\"(\",Ergebnismenge!C135,\", \",F135,\")\"))","v":0},null,null,null,null,null,null,{"$f":"IF(AND(SUM($G$92:G134)>0,G135>0),\", \",\"\")","v":""},"",null,null,null,null,null,null,""]
[null,null,45,null,null,"rot",{"$f":"COUNTIF(Kugeln!$X$4:$X$52,CONCATENATE(\"(\",Ergebnismenge!C136,\", \",F136,\")\"))","v":0},null,null,null,null,null,null,{"$f":"IF(AND(SUM($G$92:G135)>0,G136>0),\", \",\"\")","v":""},"",null,null,null,null,null,null,""]
[null,null,46,null,null,"rot",{"$f":"COUNTIF(Kugeln!$X$4:$X$52,CONCATENATE(\"(\",Ergebnismenge!C137,\", \",F137,\")\"))","v":0},null,null,null,null,null,null,{"$f":"IF(AND(SUM($G$92:G136)>0,G137>0),\", \",\"\")","v":""},"",null,null,null,null,null,null,""]
[null,null,47,null,null,"rot",{"$f":"COUNTIF(Kugeln!$X$4:$X$52,CONCATENATE(\"(\",Ergebnismenge!C138,\", \",F138,\")\"))","v":0},null,null,null,null,null,null,{"$f":"IF(AND(SUM($G$92:G137)>0,G138>0),\", \",\"\")","v":""},"",null,null,null,null,null,null,""]
[null,null,48,null,null,"rot",{"$f":"COUNTIF(Kugeln!$X$4:$X$52,CONCATENATE(\"(\",Ergebnismenge!C139,\", \",F139,\")\"))","v":0},null,null,null,null,null,null,{"$f":"IF(AND(SUM($G$92:G138)>0,G139>0),\", \",\"\")","v":""},"",null,null,null,null,null,null,""]
[null,null,49,null,null,"rot",{"$f":"COUNTIF(Kugeln!$X$4:$X$52,CONCATENATE(\"(\",Ergebnismenge!C140,\", \",F140,\")\"))","v":0},null,null,null,null,null,null,{"$f":"IF(AND(SUM($G$92:G139)>0,G140>0),\", \",\"\")","v":""},"",null,null,null,null,null,null,""]
[null,null,1,null,null,"grün",{"$f":"COUNTIF(Kugeln!$X$4:$X$52,CONCATENATE(\"(\",Ergebnismenge!C141,\", \",F141,\")\"))","v":0},null,null,null,null,null,null,{"$f":"IF(AND(SUM($G$92:G140)>0,G141>0),\", \",\"\")","v":""},"",null,null,null,null,null,null,""]
[null,null,2,null,null,"grün",{"$f":"COUNTIF(Kugeln!$X$4:$X$52,CONCATENATE(\"(\",Ergebnismenge!C142,\", \",F142,\")\"))","v":2},null,null,null,null,null,null,{"$f":"IF(AND(SUM($G$92:G141)>0,G142>0),\", \",\"\")","v":", "},"(grün, 2)",null,null,null,null,null,null,", (grün, 2)"]
[null,null,3,null,null,"grün",{"$f":"COUNTIF(Kugeln!$X$4:$X$52,CONCATENATE(\"(\",Ergebnismenge!C143,\", \",F143,\")\"))","v":1},null,null,null,null,null,null,{"$f":"IF(AND(SUM($G$92:G142)>0,G143>0),\", \",\"\")","v":", "},"(grün, 3)",null,null,null,null,null,null,", (grün, 3)"]
[null,null,4,null,null,"grün",{"$f":"COUNTIF(Kugeln!$X$4:$X$52,CONCATENATE(\"(\",Ergebnismenge!C144,\", \",F144,\")\"))","v":2},null,null,null,null,null,null,{"$f":"IF(AND(SUM($G$92:G143)>0,G144>0),\", \",\"\")","v":", "},"(grün, 4)",null,null,null,null,null,null,", (grün, 4)"]
[null,null,5,null,null,"grün",{"$f":"COUNTIF(Kugeln!$X$4:$X$52,CONCATENATE(\"(\",Ergebnismenge!C145,\", \",F145,\")\"))","v":1},null,null,null,null,null,null,{"$f":"IF(AND(SUM($G$92:G144)>0,G145>0),\", \",\"\")","v":", "},"(grün, 5)",null,null,null,null,null,null,", (grün, 5)"]
[null,null,6,null,null,"grün",{"$f":"COUNTIF(Kugeln!$X$4:$X$52,CONCATENATE(\"(\",Ergebnismenge!C146,\", \",F146,\")\"))","v":2},null,null,null,null,null,null,{"$f":"IF(AND(SUM($G$92:G145)>0,G146>0),\", \",\"\")","v":", "},"(grün, 6)",null,null,null,null,null,null,", (grün, 6)"]
[null,null,7,null,null,"grün",{"$f":"COUNTIF(Kugeln!$X$4:$X$52,CONCATENATE(\"(\",Ergebnismenge!C147,\", \",F147,\")\"))","v":2},null,null,null,null,null,null,{"$f":"IF(AND(SUM($G$92:G146)>0,G147>0),\", \",\"\")","v":", "},"(grün, 7)",null,null,null,null,null,null,", (grün, 7)"]
[null,null,8,null,null,"grün",{"$f":"COUNTIF(Kugeln!$X$4:$X$52,CONCATENATE(\"(\",Ergebnismenge!C148,\", \",F148,\")\"))","v":3},null,null,null,null,null,null,{"$f":"IF(AND(SUM($G$92:G147)>0,G148>0),\", \",\"\")","v":", "},"(grün, 8)",null,null,null,null,null,null,", (grün, 8)"]
[null,null,9,null,null,"grün",{"$f":"COUNTIF(Kugeln!$X$4:$X$52,CONCATENATE(\"(\",Ergebnismenge!C149,\", \",F149,\")\"))","v":2},null,null,null,null,null,null,{"$f":"IF(AND(SUM($G$92:G148)>0,G149>0),\", \",\"\")","v":", "},"(grün, 9)",null,null,null,null,null,null,", (grün, 9)"]
[null,null,10,null,null,"grün",{"$f":"COUNTIF(Kugeln!$X$4:$X$52,CONCATENATE(\"(\",Ergebnismenge!C150,\", \",F150,\")\"))","v":0},null,null,null,null,null,null,{"$f":"IF(AND(SUM($G$92:G149)>0,G150>0),\", \",\"\")","v":""},"",null,null,null,null,null,null,""]
[null,null,11,null,null,"grün",{"$f":"COUNTIF(Kugeln!$X$4:$X$52,CONCATENATE(\"(\",Ergebnismenge!C151,\", \",F151,\")\"))","v":0},null,null,null,null,null,null,{"$f":"IF(AND(SUM($G$92:G150)>0,G151>0),\", \",\"\")","v":""},"",null,null,null,null,null,null,""]
[null,null,12,null,null,"grün",{"$f":"COUNTIF(Kugeln!$X$4:$X$52,CONCATENATE(\"(\",Ergebnismenge!C152,\", \",F152,\")\"))","v":0},null,null,null,null,null,null,{"$f":"IF(AND(SUM($G$92:G151)>0,G152>0),\", \",\"\")","v":""},"",null,null,null,null,null,null,""]
[null,null,13,null,null,"grün",{"$f":"COUNTIF(Kugeln!$X$4:$X$52,CONCATENATE(\"(\",Ergebnismenge!C153,\", \",F153,\")\"))","v":0},null,null,null,null,null,null,{"$f":"IF(AND(SUM($G$92:G152)>0,G153>0),\", \",\"\")","v":""},"",null,null,null,null,null,null,""]
[null,null,14,null,null,"grün",{"$f":"COUNTIF(Kugeln!$X$4:$X$52,CONCATENATE(\"(\",Ergebnismenge!C154,\", \",F154,\")\"))","v":0},null,null,null,null,null,null,{"$f":"IF(AND(SUM($G$92:G153)>0,G154>0),\", \",\"\")","v":""},"",null,null,null,null,null,null,""]
[null,null,15,null,null,"grün",{"$f":"COUNTIF(Kugeln!$X$4:$X$52,CONCATENATE(\"(\",Ergebnismenge!C155,\", \",F155,\")\"))","v":0},null,null,null,null,null,null,{"$f":"IF(AND(SUM($G$92:G154)>0,G155>0),\", \",\"\")","v":""},"",null,null,null,null,null,null,""]
[null,null,16,null,null,"grün",{"$f":"COUNTIF(Kugeln!$X$4:$X$52,CONCATENATE(\"(\",Ergebnismenge!C156,\", \",F156,\")\"))","v":0},null,null,null,null,null,null,{"$f":"IF(AND(SUM($G$92:G155)>0,G156>0),\", \",\"\")","v":""},"",null,null,null,null,null,null,""]
[null,null,17,null,null,"grün",{"$f":"COUNTIF(Kugeln!$X$4:$X$52,CONCATENATE(\"(\",Ergebnismenge!C157,\", \",F157,\")\"))","v":0},null,null,null,null,null,null,{"$f":"IF(AND(SUM($G$92:G156)>0,G157>0),\", \",\"\")","v":""},"",null,null,null,null,null,null,""]
[null,null,18,null,null,"grün",{"$f":"COUNTIF(Kugeln!$X$4:$X$52,CONCATENATE(\"(\",Ergebnismenge!C158,\", \",F158,\")\"))","v":0},null,null,null,null,null,null,{"$f":"IF(AND(SUM($G$92:G157)>0,G158>0),\", \",\"\")","v":""},"",null,null,null,null,null,null,""]
[null,null,19,null,null,"grün",{"$f":"COUNTIF(Kugeln!$X$4:$X$52,CONCATENATE(\"(\",Ergebnismenge!C159,\", \",F159,\")\"))","v":0},null,null,null,null,null,null,{"$f":"IF(AND(SUM($G$92:G158)>0,G159>0),\", \",\"\")","v":""},{"$f":"IF(G159>0,CONCATENATE(\"(\",F159,\", \",C159,\")\"),\"\")","v":""},null,null,null,null,null,null,""]
[null,null,20,null,null,"grün",{"$f":"COUNTIF(Kugeln!$X$4:$X$52,CONCATENATE(\"(\",Ergebnismenge!C160,\", \",F160,\")\"))","v":0},null,null,null,null,null,null,{"$f":"IF(AND(SUM($G$92:G159)>0,G160>0),\", \",\"\")","v":""},"",null,null,null,null,null,null,""]
[null,null,21,null,null,"grün",{"$f":"COUNTIF(Kugeln!$X$4:$X$52,CONCATENATE(\"(\",Ergebnismenge!C161,\", \",F161,\")\"))","v":0},null,null,null,null,null,null,{"$f":"IF(AND(SUM($G$92:G160)>0,G161>0),\", \",\"\")","v":""},"",null,null,null,null,null,null,{"$f":"CONCATENATE(N161,O161)","v":""}]
[null,null,22,null,null,"grün",{"$f":"COUNTIF(Kugeln!$X$4:$X$52,CONCATENATE(\"(\",Ergebnismenge!C162,\", \",F162,\")\"))","v":0},null,null,null,null,null,null,{"$f":"IF(AND(SUM($G$92:G161)>0,G162>0),\", \",\"\")","v":""},"",null,null,null,null,null,null,""]
[null,null,23,null,null,"grün",{"$f":"COUNTIF(Kugeln!$X$4:$X$52,CONCATENATE(\"(\",Ergebnismenge!C163,\", \",F163,\")\"))","v":0},null,null,null,null,null,null,{"$f":"IF(AND(SUM($G$92:G162)>0,G163>0),\", \",\"\")","v":""},"",null,null,null,null,null,null,""]
[null,null,24,null,null,"grün",{"$f":"COUNTIF(Kugeln!$X$4:$X$52,CONCATENATE(\"(\",Ergebnismenge!C164,\", \",F164,\")\"))","v":0},null,null,null,null,null,null,{"$f":"IF(AND(SUM($G$92:G163)>0,G164>0),\", \",\"\")","v":""},"",null,null,null,null,null,null,""]
[null,null,25,null,null,"grün",{"$f":"COUNTIF(Kugeln!$X$4:$X$52,CONCATENATE(\"(\",Ergebnismenge!C165,\", \",F165,\")\"))","v":0},null,null,null,null,null,null,{"$f":"IF(AND(SUM($G$92:G164)>0,G165>0),\", \",\"\")","v":""},"",null,null,null,null,null,null,""]
[null,null,26,null,null,"grün",{"$f":"COUNTIF(Kugeln!$X$4:$X$52,CONCATENATE(\"(\",Ergebnismenge!C166,\", \",F166,\")\"))","v":0},null,null,null,null,null,null,{"$f":"IF(AND(SUM($G$92:G165)>0,G166>0),\", \",\"\")","v":""},"",null,null,null,null,null,null,""]
[null,null,27,null,null,"grün",{"$f":"COUNTIF(Kugeln!$X$4:$X$52,CONCATENATE(\"(\",Ergebnismenge!C167,\", \",F167,\")\"))","v":0},null,null,null,null,null,null,{"$f":"IF(AND(SUM($G$92:G166)>0,G167>0),\", \",\"\")","v":""},"",null,null,null,null,null,null,""]
[null,null,28,null,null,"grün",{"$f":"COUNTIF(Kugeln!$X$4:$X$52,CONCATENATE(\"(\",Ergebnismenge!C168,\", \",F168,\")\"))","v":0},null,null,null,null,null,null,{"$f":"IF(AND(SUM($G$92:G167)>0,G168>0),\", \",\"\")","v":""},"",null,null,null,null,null,null,""]
[null,null,29,null,null,"grün",{"$f":"COUNTIF(Kugeln!$X$4:$X$52,CONCATENATE(\"(\",Ergebnismenge!C169,\", \",F169,\")\"))","v":0},null,null,null,null,null,null,{"$f":"IF(AND(SUM($G$92:G168)>0,G169>0),\", \",\"\")","v":""},"",null,null,null,null,null,null,""]
[null,null,30,null,null,"grün",{"$f":"COUNTIF(Kugeln!$X$4:$X$52,CONCATENATE(\"(\",Ergebnismenge!C170,\", \",F170,\")\"))","v":0},null,null,null,null,null,null,{"$f":"IF(AND(SUM($G$92:G169)>0,G170>0),\", \",\"\")","v":""},"",null,null,null,null,null,null,""]
[null,null,31,null,null,"grün",{"$f":"COUNTIF(Kugeln!$X$4:$X$52,CONCATENATE(\"(\",Ergebnismenge!C171,\", \",F171,\")\"))","v":0},null,null,null,null,null,null,{"$f":"IF(AND(SUM($G$92:G170)>0,G171>0),\", \",\"\")","v":""},"",null,null,null,null,null,null,""]
[null,null,32,null,null,"grün",{"$f":"COUNTIF(Kugeln!$X$4:$X$52,CONCATENATE(\"(\",Ergebnismenge!C172,\", \",F172,\")\"))","v":0},null,null,null,null,null,null,{"$f":"IF(AND(SUM($G$92:G171)>0,G172>0),\", \",\"\")","v":""},"",null,null,null,null,null,null,""]
[null,null,33,null,null,"grün",{"$f":"COUNTIF(Kugeln!$X$4:$X$52,CONCATENATE(\"(\",Ergebnismenge!C173,\", \",F173,\")\"))","v":0},null,null,null,null,null,null,{"$f":"IF(AND(SUM($G$92:G172)>0,G173>0),\", \",\"\")","v":""},"",null,null,null,null,null,null,""]
[null,null,34,null,null,"grün",{"$f":"COUNTIF(Kugeln!$X$4:$X$52,CONCATENATE(\"(\",Ergebnismenge!C174,\", \",F174,\")\"))","v":0},null,null,null,null,null,null,{"$f":"IF(AND(SUM($G$92:G173)>0,G174>0),\", \",\"\")","v":""},"",null,null,null,null,null,null,""]
[null,null,35,null,null,"grün",{"$f":"COUNTIF(Kugeln!$X$4:$X$52,CONCATENATE(\"(\",Ergebnismenge!C175,\", \",F175,\")\"))","v":0},null,null,null,null,null,null,{"$f":"IF(AND(SUM($G$92:G174)>0,G175>0),\", \",\"\")","v":""},"",null,null,null,null,null,null,""]
[null,null,36,null,null,"grün",{"$f":"COUNTIF(Kugeln!$X$4:$X$52,CONCATENATE(\"(\",Ergebnismenge!C176,\", \",F176,\")\"))","v":0},null,null,null,null,null,null,{"$f":"IF(AND(SUM($G$92:G175)>0,G176>0),\", \",\"\")","v":""},"",null,null,null,null,null,null,""]
[null,null,37,null,null,"grün",{"$f":"COUNTIF(Kugeln!$X$4:$X$52,CONCATENATE(\"(\",Ergebnismenge!C177,\", \",F177,\")\"))","v":0},null,null,null,null,null,null,{"$f":"IF(AND(SUM($G$92:G176)>0,G177>0),\", \",\"\")","v":""},"",null,null,null,null,null,null,""]
[null,null,38,null,null,"grün",{"$f":"COUNTIF(Kugeln!$X$4:$X$52,CONCATENATE(\"(\",Ergebnismenge!C178,\", \",F178,\")\"))","v":0},null,null,null,null,null,null,{"$f":"IF(AND(SUM($G$92:G177)>0,G178>0),\", \",\"\")","v":""},"",null,null,null,null,null,null,""]
[null,null,39,null,null,"grün",{"$f":"COUNTIF(Kugeln!$X$4:$X$52,CONCATENATE(\"(\",Ergebnismenge!C179,\", \",F179,\")\"))","v":0},null,null,null,null,null,null,{"$f":"IF(AND(SUM($G$92:G178)>0,G179>0),\", \",\"\")","v":""},"",null,null,null,null,null,null,""]
[null,null,40,null,null,"grün",{"$f":"COUNTIF(Kugeln!$X$4:$X$52,CONCATENATE(\"(\",Ergebnismenge!C180,\", \",F180,\")\"))","v":0},null,null,null,null,null,null,{"$f":"IF(AND(SUM($G$92:G179)>0,G180>0),\", \",\"\")","v":""},"",null,null,null,null,null,null,""]
[null,null,41,null,null,"grün",{"$f":"COUNTIF(Kugeln!$X$4:$X$52,CONCATENATE(\"(\",Ergebnismenge!C181,\", \",F181,\")\"))","v":0},null,null,null,null,null,null,{"$f":"IF(AND(SUM($G$92:G180)>0,G181>0),\", \",\"\")","v":""},"",null,null,null,null,null,null,""]
[null,null,42,null,null,"grün",{"$f":"COUNTIF(Kugeln!$X$4:$X$52,CONCATENATE(\"(\",Ergebnismenge!C182,\", \",F182,\")\"))","v":0},null,null,null,null,null,null,{"$f":"IF(AND(SUM($G$92:G181)>0,G182>0),\", \",\"\")","v":""},"",null,null,null,null,null,null,""]
[null,null,43,null,null,"grün",{"$f":"COUNTIF(Kugeln!$X$4:$X$52,CONCATENATE(\"(\",Ergebnismenge!C183,\", \",F183,\")\"))","v":0},null,null,null,null,null,null,{"$f":"IF(AND(SUM($G$92:G182)>0,G183>0),\", \",\"\")","v":""},"",null,null,null,null,null,null,""]
[null,null,44,null,null,"grün",{"$f":"COUNTIF(Kugeln!$X$4:$X$52,CONCATENATE(\"(\",Ergebnismenge!C184,\", \",F184,\")\"))","v":0},null,null,null,null,null,null,{"$f":"IF(AND(SUM($G$92:G183)>0,G184>0),\", \",\"\")","v":""},"",null,null,null,null,null,null,""]
[null,null,45,null,null,"grün",{"$f":"COUNTIF(Kugeln!$X$4:$X$52,CONCATENATE(\"(\",Ergebnismenge!C185,\", \",F185,\")\"))","v":0},null,null,null,null,null,null,{"$f":"IF(AND(SUM($G$92:G184)>0,G185>0),\", \",\"\")","v":""},"",null,null,null,null,null,null,""]
[null,null,46,null,null,"grün",{"$f":"COUNTIF(Kugeln!$X$4:$X$52,CONCATENATE(\"(\",Ergebnismenge!C186,\", \",F186,\")\"))","v":0},null,null,null,null,null,null,{"$f":"IF(AND(SUM($G$92:G185)>0,G186>0),\", \",\"\")","v":""},"",null,null,null,null,null,null,""]
[null,null,47,null,null,"grün",{"$f":"COUNTIF(Kugeln!$X$4:$X$52,CONCATENATE(\"(\",Ergebnismenge!C187,\", \",F187,\")\"))","v":0},null,null,null,null,null,null,{"$f":"IF(AND(SUM($G$92:G186)>0,G187>0),\", \",\"\")","v":""},"",null,null,null,null,null,null,""]
[null,null,48,null,null,"grün",{"$f":"COUNTIF(Kugeln!$X$4:$X$52,CONCATENATE(\"(\",Ergebnismenge!C188,\", \",F188,\")\"))","v":0},null,null,null,null,null,null,{"$f":"IF(AND(SUM($G$92:G187)>0,G188>0),\", \",\"\")","v":""},"",null,null,null,null,null,null,""]
[null,null,49,null,null,"grün",{"$f":"COUNTIF(Kugeln!$X$4:$X$52,CONCATENATE(\"(\",Ergebnismenge!C189,\", \",F189,\")\"))","v":0},null,null,null,null,null,null,{"$f":"IF(AND(SUM($G$92:G188)>0,G189>0),\", \",\"\")","v":""},"",null,null,null,null,null,null,""]
[null,null,1,null,null,"blau",{"$f":"COUNTIF(Kugeln!$X$4:$X$52,CONCATENATE(\"(\",Ergebnismenge!C190,\", \",F190,\")\"))","v":0},null,null,null,null,null,null,{"$f":"IF(AND(SUM($G$92:G189)>0,G190>0),\", \",\"\")","v":""},"",null,null,null,null,null,null,""]
[null,null,2,null,null,"blau",{"$f":"COUNTIF(Kugeln!$X$4:$X$52,CONCATENATE(\"(\",Ergebnismenge!C191,\", \",F191,\")\"))","v":1},null,null,null,null,null,null,{"$f":"IF(AND(SUM($G$92:G190)>0,G191>0),\", \",\"\")","v":", "},"(blau, 2)",null,null,null,null,null,null,", (blau, 2)"]
[null,null,3,null,null,"blau",{"$f":"COUNTIF(Kugeln!$X$4:$X$52,CONCATENATE(\"(\",Ergebnismenge!C192,\", \",F192,\")\"))","v":0},null,null,null,null,null,null,{"$f":"IF(AND(SUM($G$92:G191)>0,G192>0),\", \",\"\")","v":""},"",null,null,null,null,null,null,""]
[null,null,4,null,null,"blau",{"$f":"COUNTIF(Kugeln!$X$4:$X$52,CONCATENATE(\"(\",Ergebnismenge!C193,\", \",F193,\")\"))","v":0},null,null,null,null,null,null,{"$f":"IF(AND(SUM($G$92:G192)>0,G193>0),\", \",\"\")","v":""},"",null,null,null,null,null,null,""]
[null,null,5,null,null,"blau",{"$f":"COUNTIF(Kugeln!$X$4:$X$52,CONCATENATE(\"(\",Ergebnismenge!C194,\", \",F194,\")\"))","v":2},null,null,null,null,null,null,{"$f":"IF(AND(SUM($G$92:G193)>0,G194>0),\", \",\"\")","v":", "},"(blau, 5)",null,null,null,null,null,null,", (blau, 5)"]
[null,null,6,null,null,"blau",{"$f":"COUNTIF(Kugeln!$X$4:$X$52,CONCATENATE(\"(\",Ergebnismenge!C195,\", \",F195,\")\"))","v":0},null,null,null,null,null,null,{"$f":"IF(AND(SUM($G$92:G194)>0,G195>0),\", \",\"\")","v":""},"",null,null,null,null,null,null,""]
[null,null,7,null,null,"blau",{"$f":"COUNTIF(Kugeln!$X$4:$X$52,CONCATENATE(\"(\",Ergebnismenge!C196,\", \",F196,\")\"))","v":1},null,null,null,null,null,null,{"$f":"IF(AND(SUM($G$92:G195)>0,G196>0),\", \",\"\")","v":", "},"(blau, 7)",null,null,null,null,null,null,", (blau, 7)"]
[null,null,8,null,null,"blau",{"$f":"COUNTIF(Kugeln!$X$4:$X$52,CONCATENATE(\"(\",Ergebnismenge!C197,\", \",F197,\")\"))","v":1},null,null,null,null,null,null,{"$f":"IF(AND(SUM($G$92:G196)>0,G197>0),\", \",\"\")","v":", "},"(blau, 8)",null,null,null,null,null,null,", (blau, 8)"]
[null,null,9,null,null,"blau",{"$f":"COUNTIF(Kugeln!$X$4:$X$52,CONCATENATE(\"(\",Ergebnismenge!C198,\", \",F198,\")\"))","v":2},null,null,null,null,null,null,{"$f":"IF(AND(SUM($G$92:G197)>0,G198>0),\", \",\"\")","v":", "},"(blau, 9)",null,null,null,null,null,null,", (blau, 9)"]
[null,null,10,null,null,"blau",{"$f":"COUNTIF(Kugeln!$X$4:$X$52,CONCATENATE(\"(\",Ergebnismenge!C199,\", \",F199,\")\"))","v":0},null,null,null,null,null,null,{"$f":"IF(AND(SUM($G$92:G198)>0,G199>0),\", \",\"\")","v":""},"",null,null,null,null,null,null,""]
[null,null,11,null,null,"blau",{"$f":"COUNTIF(Kugeln!$X$4:$X$52,CONCATENATE(\"(\",Ergebnismenge!C200,\", \",F200,\")\"))","v":0},null,null,null,null,null,null,{"$f":"IF(AND(SUM($G$92:G199)>0,G200>0),\", \",\"\")","v":""},"",null,null,null,null,null,null,""]
[null,null,12,null,null,"blau",{"$f":"COUNTIF(Kugeln!$X$4:$X$52,CONCATENATE(\"(\",Ergebnismenge!C201,\", \",F201,\")\"))","v":0},null,null,null,null,null,null,{"$f":"IF(AND(SUM($G$92:G200)>0,G201>0),\", \",\"\")","v":""},"",null,null,null,null,null,null,""]
[null,null,13,null,null,"blau",{"$f":"COUNTIF(Kugeln!$X$4:$X$52,CONCATENATE(\"(\",Ergebnismenge!C202,\", \",F202,\")\"))","v":0},null,null,null,null,null,null,{"$f":"IF(AND(SUM($G$92:G201)>0,G202>0),\", \",\"\")","v":""},"",null,null,null,null,null,null,""]
[null,null,14,null,null,"blau",{"$f":"COUNTIF(Kugeln!$X$4:$X$52,CONCATENATE(\"(\",Ergebnismenge!C203,\", \",F203,\")\"))","v":0},null,null,null,null,null,null,{"$f":"IF(AND(SUM($G$92:G202)>0,G203>0),\", \",\"\")","v":""},"",null,null,null,null,null,null,""]
[null,null,15,null,null,"blau",{"$f":"COUNTIF(Kugeln!$X$4:$X$52,CONCATENATE(\"(\",Ergebnismenge!C204,\", \",F204,\")\"))","v":0},null,null,null,null,null,null,{"$f":"IF(AND(SUM($G$92:G203)>0,G204>0),\", \",\"\")","v":""},"",null,null,null,null,null,null,""]
[null,null,16,null,null,"blau",{"$f":"COUNTIF(Kugeln!$X$4:$X$52,CONCATENATE(\"(\",Ergebnismenge!C205,\", \",F205,\")\"))","v":0},null,null,null,null,null,null,{"$f":"IF(AND(SUM($G$92:G204)>0,G205>0),\", \",\"\")","v":""},"",null,null,null,null,null,null,""]
[null,null,17,null,null,"blau",{"$f":"COUNTIF(Kugeln!$X$4:$X$52,CONCATENATE(\"(\",Ergebnismenge!C206,\", \",F206,\")\"))","v":0},null,null,null,null,null,null,{"$f":"IF(AND(SUM($G$92:G205)>0,G206>0),\", \",\"\")","v":""},"",null,null,null,null,null,null,""]
[null,null,18,null,null,"blau",{"$f":"COUNTIF(Kugeln!$X$4:$X$52,CONCATENATE(\"(\",Ergebnismenge!C207,\", \",F207,\")\"))","v":0},null,null,null,null,null,null,{"$f":"IF(AND(SUM($G$92:G206)>0,G207>0),\", \",\"\")","v":""},"",null,null,null,null,null,null,""]
[null,null,19,null,null,"blau",{"$f":"COUNTIF(Kugeln!$X$4:$X$52,CONCATENATE(\"(\",Ergebnismenge!C208,\", \",F208,\")\"))","v":0},null,null,null,null,null,null,{"$f":"IF(AND(SUM($G$92:G207)>0,G208>0),\", \",\"\")","v":""},"",null,null,null,null,null,null,""]
[null,null,20,null,null,"blau",{"$f":"COUNTIF(Kugeln!$X$4:$X$52,CONCATENATE(\"(\",Ergebnismenge!C209,\", \",F209,\")\"))","v":0},null,null,null,null,null,null,{"$f":"IF(AND(SUM($G$92:G208)>0,G209>0),\", \",\"\")","v":""},"",null,null,null,null,null,null,""]
[null,null,21,null,null,"blau",{"$f":"COUNTIF(Kugeln!$X$4:$X$52,CONCATENATE(\"(\",Ergebnismenge!C210,\", \",F210,\")\"))","v":0},null,null,null,null,null,null,{"$f":"IF(AND(SUM($G$92:G209)>0,G210>0),\", \",\"\")","v":""},"",null,null,null,null,null,null,""]
[null,null,22,null,null,"blau",{"$f":"COUNTIF(Kugeln!$X$4:$X$52,CONCATENATE(\"(\",Ergebnismenge!C211,\", \",F211,\")\"))","v":0},null,null,null,null,null,null,{"$f":"IF(AND(SUM($G$92:G210)>0,G211>0),\", \",\"\")","v":""},"",null,null,null,null,null,null,""]
[null,null,23,null,null,"blau",{"$f":"COUNTIF(Kugeln!$X$4:$X$52,CONCATENATE(\"(\",Ergebnismenge!C212,\", \",F212,\")\"))","v":0},null,null,null,null,null,null,{"$f":"IF(AND(SUM($G$92:G211)>0,G212>0),\", \",\"\")","v":""},"",null,null,null,null,null,null,""]
[null,null,24,null,null,"blau",{"$f":"COUNTIF(Kugeln!$X$4:$X$52,CONCATENATE(\"(\",Ergebnismenge!C213,\", \",F213,\")\"))","v":0},null,null,null,null,null,null,{"$f":"IF(AND(SUM($G$92:G212)>0,G213>0),\", \",\"\")","v":""},"",null,null,null,null,null,null,""]
[null,null,25,null,null,"blau",{"$f":"COUNTIF(Kugeln!$X$4:$X$52,CONCATENATE(\"(\",Ergebnismenge!C214,\", \",F214,\")\"))","v":0},null,null,null,null,null,null,{"$f":"IF(AND(SUM($G$92:G213)>0,G214>0),\", \",\"\")","v":""},"",null,null,null,null,null,null,""]
[null,null,26,null,null,"blau",{"$f":"COUNTIF(Kugeln!$X$4:$X$52,CONCATENATE(\"(\",Ergebnismenge!C215,\", \",F215,\")\"))","v":0},null,null,null,null,null,null,{"$f":"IF(AND(SUM($G$92:G214)>0,G215>0),\", \",\"\")","v":""},"",null,null,null,null,null,null,""]
[null,null,27,null,null,"blau",{"$f":"COUNTIF(Kugeln!$X$4:$X$52,CONCATENATE(\"(\",Ergebnismenge!C216,\", \",F216,\")\"))","v":0},null,null,null,null,null,null,{"$f":"IF(AND(SUM($G$92:G215)>0,G216>0),\", \",\"\")","v":""},"",null,null,null,null,null,null,""]
[null,null,28,null,null,"blau",{"$f":"COUNTIF(Kugeln!$X$4:$X$52,CONCATENATE(\"(\",Ergebnismenge!C217,\", \",F217,\")\"))","v":0},null,null,null,null,null,null,{"$f":"IF(AND(SUM($G$92:G216)>0,G217>0),\", \",\"\")","v":""},"",null,null,null,null,null,null,""]
[null,null,29,null,null,"blau",{"$f":"COUNTIF(Kugeln!$X$4:$X$52,CONCATENATE(\"(\",Ergebnismenge!C218,\", \",F218,\")\"))","v":0},null,null,null,null,null,null,{"$f":"IF(AND(SUM($G$92:G217)>0,G218>0),\", \",\"\")","v":""},"",null,null,null,null,null,null,""]
[null,null,30,null,null,"blau",{"$f":"COUNTIF(Kugeln!$X$4:$X$52,CONCATENATE(\"(\",Ergebnismenge!C219,\", \",F219,\")\"))","v":0},null,null,null,null,null,null,{"$f":"IF(AND(SUM($G$92:G218)>0,G219>0),\", \",\"\")","v":""},"",null,null,null,null,null,null,""]
[null,null,31,null,null,"blau",{"$f":"COUNTIF(Kugeln!$X$4:$X$52,CONCATENATE(\"(\",Ergebnismenge!C220,\", \",F220,\")\"))","v":0},null,null,null,null,null,null,{"$f":"IF(AND(SUM($G$92:G219)>0,G220>0),\", \",\"\")","v":""},"",null,null,null,null,null,null,""]
[null,null,32,null,null,"blau",{"$f":"COUNTIF(Kugeln!$X$4:$X$52,CONCATENATE(\"(\",Ergebnismenge!C221,\", \",F221,\")\"))","v":0},null,null,null,null,null,null,{"$f":"IF(AND(SUM($G$92:G220)>0,G221>0),\", \",\"\")","v":""},"",null,null,null,null,null,null,""]
[null,null,33,null,null,"blau",{"$f":"COUNTIF(Kugeln!$X$4:$X$52,CONCATENATE(\"(\",Ergebnismenge!C222,\", \",F222,\")\"))","v":0},null,null,null,null,null,null,{"$f":"IF(AND(SUM($G$92:G221)>0,G222>0),\", \",\"\")","v":""},"",null,null,null,null,null,null,""]
[null,null,34,null,null,"blau",{"$f":"COUNTIF(Kugeln!$X$4:$X$52,CONCATENATE(\"(\",Ergebnismenge!C223,\", \",F223,\")\"))","v":0},null,null,null,null,null,null,{"$f":"IF(AND(SUM($G$92:G222)>0,G223>0),\", \",\"\")","v":""},{"$f":"IF(G223>0,CONCATENATE(\"(\",F223,\", \",C223,\")\"),\"\")","v":""},null,null,null,null,null,null,""]
[null,null,35,null,null,"blau",{"$f":"COUNTIF(Kugeln!$X$4:$X$52,CONCATENATE(\"(\",Ergebnismenge!C224,\", \",F224,\")\"))","v":0},null,null,null,null,null,null,{"$f":"IF(AND(SUM($G$92:G223)>0,G224>0),\", \",\"\")","v":""},"",null,null,null,null,null,null,""]
[null,null,36,null,null,"blau",{"$f":"COUNTIF(Kugeln!$X$4:$X$52,CONCATENATE(\"(\",Ergebnismenge!C225,\", \",F225,\")\"))","v":0},null,null,null,null,null,null,{"$f":"IF(AND(SUM($G$92:G224)>0,G225>0),\", \",\"\")","v":""},"",null,null,null,null,null,null,{"$f":"CONCATENATE(N225,O225)","v":""}]
[null,null,37,null,null,"blau",{"$f":"COUNTIF(Kugeln!$X$4:$X$52,CONCATENATE(\"(\",Ergebnismenge!C226,\", \",F226,\")\"))","v":0},null,null,null,null,null,null,{"$f":"IF(AND(SUM($G$92:G225)>0,G226>0),\", \",\"\")","v":""},"",null,null,null,null,null,null,""]
[null,null,38,null,null,"blau",{"$f":"COUNTIF(Kugeln!$X$4:$X$52,CONCATENATE(\"(\",Ergebnismenge!C227,\", \",F227,\")\"))","v":0},null,null,null,null,null,null,{"$f":"IF(AND(SUM($G$92:G226)>0,G227>0),\", \",\"\")","v":""},"",null,null,null,null,null,null,""]
[null,null,39,null,null,"blau",{"$f":"COUNTIF(Kugeln!$X$4:$X$52,CONCATENATE(\"(\",Ergebnismenge!C228,\", \",F228,\")\"))","v":0},null,null,null,null,null,null,{"$f":"IF(AND(SUM($G$92:G227)>0,G228>0),\", \",\"\")","v":""},"",null,null,null,null,null,null,""]
[null,null,40,null,null,"blau",{"$f":"COUNTIF(Kugeln!$X$4:$X$52,CONCATENATE(\"(\",Ergebnismenge!C229,\", \",F229,\")\"))","v":0},null,null,null,null,null,null,{"$f":"IF(AND(SUM($G$92:G228)>0,G229>0),\", \",\"\")","v":""},"",null,null,null,null,null,null,""]
[null,null,41,null,null,"blau",{"$f":"COUNTIF(Kugeln!$X$4:$X$52,CONCATENATE(\"(\",Ergebnismenge!C230,\", \",F230,\")\"))","v":0},null,null,null,null,null,null,{"$f":"IF(AND(SUM($G$92:G229)>0,G230>0),\", \",\"\")","v":""},"",null,null,null,null,null,null,""]
[null,null,42,null,null,"blau",{"$f":"COUNTIF(Kugeln!$X$4:$X$52,CONCATENATE(\"(\",Ergebnismenge!C231,\", \",F231,\")\"))","v":0},null,null,null,null,null,null,{"$f":"IF(AND(SUM($G$92:G230)>0,G231>0),\", \",\"\")","v":""},"",null,null,null,null,null,null,""]
[null,null,43,null,null,"blau",{"$f":"COUNTIF(Kugeln!$X$4:$X$52,CONCATENATE(\"(\",Ergebnismenge!C232,\", \",F232,\")\"))","v":0},null,null,null,null,null,null,{"$f":"IF(AND(SUM($G$92:G231)>0,G232>0),\", \",\"\")","v":""},"",null,null,null,null,null,null,""]
[null,null,44,null,null,"blau",{"$f":"COUNTIF(Kugeln!$X$4:$X$52,CONCATENATE(\"(\",Ergebnismenge!C233,\", \",F233,\")\"))","v":0},null,null,null,null,null,null,{"$f":"IF(AND(SUM($G$92:G232)>0,G233>0),\", \",\"\")","v":""},"",null,null,null,null,null,null,""]
[null,null,45,null,null,"blau",{"$f":"COUNTIF(Kugeln!$X$4:$X$52,CONCATENATE(\"(\",Ergebnismenge!C234,\", \",F234,\")\"))","v":0},null,null,null,null,null,null,{"$f":"IF(AND(SUM($G$92:G233)>0,G234>0),\", \",\"\")","v":""},"",null,null,null,null,null,null,""]
[null,null,46,null,null,"blau",{"$f":"COUNTIF(Kugeln!$X$4:$X$52,CONCATENATE(\"(\",Ergebnismenge!C235,\", \",F235,\")\"))","v":0},null,null,null,null,null,null,{"$f":"IF(AND(SUM($G$92:G234)>0,G235>0),\", \",\"\")","v":""},"",null,null,null,null,null,null,""]
[null,null,47,null,null,"blau",{"$f":"COUNTIF(Kugeln!$X$4:$X$52,CONCATENATE(\"(\",Ergebnismenge!C236,\", \",F236,\")\"))","v":0},null,null,null,null,null,null,{"$f":"IF(AND(SUM($G$92:G235)>0,G236>0),\", \",\"\")","v":""},"",null,null,null,null,null,null,""]
[null,null,48,null,null,"blau",{"$f":"COUNTIF(Kugeln!$X$4:$X$52,CONCATENATE(\"(\",Ergebnismenge!C237,\", \",F237,\")\"))","v":0},null,null,null,null,null,null,{"$f":"IF(AND(SUM($G$92:G236)>0,G237>0),\", \",\"\")","v":""},"",null,null,null,null,null,null,""]
[null,null,49,null,null,"blau",{"$f":"COUNTIF(Kugeln!$X$4:$X$52,CONCATENATE(\"(\",Ergebnismenge!C238,\", \",F238,\")\"))","v":0},null,null,null,null,null,null,{"$f":"IF(AND(SUM($G$92:G237)>0,G238>0),\", \",\"\")","v":""},"",null,null,null,null,null,null,""]
[null,null,1,null,null,"gelb",{"$f":"COUNTIF(Kugeln!$X$4:$X$52,CONCATENATE(\"(\",Ergebnismenge!C239,\", \",F239,\")\"))","v":0},null,null,null,null,null,null,{"$f":"IF(AND(SUM($G$92:G238)>0,G239>0),\", \",\"\")","v":""},"",null,null,null,null,null,null,""]
[null,null,2,null,null,"gelb",{"$f":"COUNTIF(Kugeln!$X$4:$X$52,CONCATENATE(\"(\",Ergebnismenge!C240,\", \",F240,\")\"))","v":0},null,null,null,null,null,null,{"$f":"IF(AND(SUM($G$92:G239)>0,G240>0),\", \",\"\")","v":""},"",null,null,null,null,null,null,""]
[null,null,3,null,null,"gelb",{"$f":"COUNTIF(Kugeln!$X$4:$X$52,CONCATENATE(\"(\",Ergebnismenge!C241,\", \",F241,\")\"))","v":1},null,null,null,null,null,null,{"$f":"IF(AND(SUM($G$92:G240)>0,G241>0),\", \",\"\")","v":", "},"(gelb, 3)",null,null,null,null,null,null,", (gelb, 3)"]
[null,null,4,null,null,"gelb",{"$f":"COUNTIF(Kugeln!$X$4:$X$52,CONCATENATE(\"(\",Ergebnismenge!C242,\", \",F242,\")\"))","v":1},null,null,null,null,null,null,{"$f":"IF(AND(SUM($G$92:G241)>0,G242>0),\", \",\"\")","v":", "},"(gelb, 4)",null,null,null,null,null,null,", (gelb, 4)"]
[null,null,5,null,null,"gelb",{"$f":"COUNTIF(Kugeln!$X$4:$X$52,CONCATENATE(\"(\",Ergebnismenge!C243,\", \",F243,\")\"))","v":2},null,null,null,null,null,null,{"$f":"IF(AND(SUM($G$92:G242)>0,G243>0),\", \",\"\")","v":", "},"(gelb, 5)",null,null,null,null,null,null,", (gelb, 5)"]
[null,null,6,null,null,"gelb",{"$f":"COUNTIF(Kugeln!$X$4:$X$52,CONCATENATE(\"(\",Ergebnismenge!C244,\", \",F244,\")\"))","v":2},null,null,null,null,null,null,{"$f":"IF(AND(SUM($G$92:G243)>0,G244>0),\", \",\"\")","v":", "},"(gelb, 6)",null,null,null,null,null,null,", (gelb, 6)"]
[null,null,7,null,null,"gelb",{"$f":"COUNTIF(Kugeln!$X$4:$X$52,CONCATENATE(\"(\",Ergebnismenge!C245,\", \",F245,\")\"))","v":1},null,null,null,null,null,null,{"$f":"IF(AND(SUM($G$92:G244)>0,G245>0),\", \",\"\")","v":", "},"(gelb, 7)",null,null,null,null,null,null,", (gelb, 7)"]
[null,null,8,null,null,"gelb",{"$f":"COUNTIF(Kugeln!$X$4:$X$52,CONCATENATE(\"(\",Ergebnismenge!C246,\", \",F246,\")\"))","v":0},null,null,null,null,null,null,{"$f":"IF(AND(SUM($G$92:G245)>0,G246>0),\", \",\"\")","v":""},"",null,null,null,null,null,null,""]
[null,null,9,null,null,"gelb",{"$f":"COUNTIF(Kugeln!$X$4:$X$52,CONCATENATE(\"(\",Ergebnismenge!C247,\", \",F247,\")\"))","v":2},null,null,null,null,null,null,{"$f":"IF(AND(SUM($G$92:G246)>0,G247>0),\", \",\"\")","v":", "},"(gelb, 9)",null,null,null,null,null,null,", (gelb, 9)"]
[null,null,10,null,null,"gelb",{"$f":"COUNTIF(Kugeln!$X$4:$X$52,CONCATENATE(\"(\",Ergebnismenge!C248,\", \",F248,\")\"))","v":0},null,null,null,null,null,null,{"$f":"IF(AND(SUM($G$92:G247)>0,G248>0),\", \",\"\")","v":""},"",null,null,null,null,null,null,""]
[null,null,11,null,null,"gelb",{"$f":"COUNTIF(Kugeln!$X$4:$X$52,CONCATENATE(\"(\",Ergebnismenge!C249,\", \",F249,\")\"))","v":0},null,null,null,null,null,null,{"$f":"IF(AND(SUM($G$92:G248)>0,G249>0),\", \",\"\")","v":""},"",null,null,null,null,null,null,""]
[null,null,12,null,null,"gelb",{"$f":"COUNTIF(Kugeln!$X$4:$X$52,CONCATENATE(\"(\",Ergebnismenge!C250,\", \",F250,\")\"))","v":0},null,null,null,null,null,null,{"$f":"IF(AND(SUM($G$92:G249)>0,G250>0),\", \",\"\")","v":""},"",null,null,null,null,null,null,""]
[null,null,13,null,null,"gelb",{"$f":"COUNTIF(Kugeln!$X$4:$X$52,CONCATENATE(\"(\",Ergebnismenge!C251,\", \",F251,\")\"))","v":0},null,null,null,null,null,null,{"$f":"IF(AND(SUM($G$92:G250)>0,G251>0),\", \",\"\")","v":""},"",null,null,null,null,null,null,""]
[null,null,14,null,null,"gelb",{"$f":"COUNTIF(Kugeln!$X$4:$X$52,CONCATENATE(\"(\",Ergebnismenge!C252,\", \",F252,\")\"))","v":0},null,null,null,null,null,null,{"$f":"IF(AND(SUM($G$92:G251)>0,G252>0),\", \",\"\")","v":""},"",null,null,null,null,null,null,""]
[null,null,15,null,null,"gelb",{"$f":"COUNTIF(Kugeln!$X$4:$X$52,CONCATENATE(\"(\",Ergebnismenge!C253,\", \",F253,\")\"))","v":0},null,null,null,null,null,null,{"$f":"IF(AND(SUM($G$92:G252)>0,G253>0),\", \",\"\")","v":""},"",null,null,null,null,null,null,""]
[null,null,16,null,null,"gelb",{"$f":"COUNTIF(Kugeln!$X$4:$X$52,CONCATENATE(\"(\",Ergebnismenge!C254,\", \",F254,\")\"))","v":0},null,null,null,null,null,null,{"$f":"IF(AND(SUM($G$92:G253)>0,G254>0),\", \",\"\")","v":""},"",null,null,null,null,null,null,""]
[null,null,17,null,null,"gelb",{"$f":"COUNTIF(Kugeln!$X$4:$X$52,CONCATENATE(\"(\",Ergebnismenge!C255,\", \",F255,\")\"))","v":0},null,null,null,null,null,null,{"$f":"IF(AND(SUM($G$92:G254)>0,G255>0),\", \",\"\")","v":""},"",null,null,null,null,null,null,""]
[null,null,18,null,null,"gelb",{"$f":"COUNTIF(Kugeln!$X$4:$X$52,CONCATENATE(\"(\",Ergebnismenge!C256,\", \",F256,\")\"))","v":0},null,null,null,null,null,null,{"$f":"IF(AND(SUM($G$92:G255)>0,G256>0),\", \",\"\")","v":""},"",null,null,null,null,null,null,""]
[null,null,19,null,null,"gelb",{"$f":"COUNTIF(Kugeln!$X$4:$X$52,CONCATENATE(\"(\",Ergebnismenge!C257,\", \",F257,\")\"))","v":0},null,null,null,null,null,null,{"$f":"IF(AND(SUM($G$92:G256)>0,G257>0),\", \",\"\")","v":""},"",null,null,null,null,null,null,""]
[null,null,20,null,null,"gelb",{"$f":"COUNTIF(Kugeln!$X$4:$X$52,CONCATENATE(\"(\",Ergebnismenge!C258,\", \",F258,\")\"))","v":0},null,null,null,null,null,null,{"$f":"IF(AND(SUM($G$92:G257)>0,G258>0),\", \",\"\")","v":""},"",null,null,null,null,null,null,""]
[null,null,21,null,null,"gelb",{"$f":"COUNTIF(Kugeln!$X$4:$X$52,CONCATENATE(\"(\",Ergebnismenge!C259,\", \",F259,\")\"))","v":0},null,null,null,null,null,null,{"$f":"IF(AND(SUM($G$92:G258)>0,G259>0),\", \",\"\")","v":""},"",null,null,null,null,null,null,""]
[null,null,22,null,null,"gelb",{"$f":"COUNTIF(Kugeln!$X$4:$X$52,CONCATENATE(\"(\",Ergebnismenge!C260,\", \",F260,\")\"))","v":0},null,null,null,null,null,null,{"$f":"IF(AND(SUM($G$92:G259)>0,G260>0),\", \",\"\")","v":""},"",null,null,null,null,null,null,""]
[null,null,23,null,null,"gelb",{"$f":"COUNTIF(Kugeln!$X$4:$X$52,CONCATENATE(\"(\",Ergebnismenge!C261,\", \",F261,\")\"))","v":0},null,null,null,null,null,null,{"$f":"IF(AND(SUM($G$92:G260)>0,G261>0),\", \",\"\")","v":""},"",null,null,null,null,null,null,""]
[null,null,24,null,null,"gelb",{"$f":"COUNTIF(Kugeln!$X$4:$X$52,CONCATENATE(\"(\",Ergebnismenge!C262,\", \",F262,\")\"))","v":0},null,null,null,null,null,null,{"$f":"IF(AND(SUM($G$92:G261)>0,G262>0),\", \",\"\")","v":""},"",null,null,null,null,null,null,""]
[null,null,25,null,null,"gelb",{"$f":"COUNTIF(Kugeln!$X$4:$X$52,CONCATENATE(\"(\",Ergebnismenge!C263,\", \",F263,\")\"))","v":0},null,null,null,null,null,null,{"$f":"IF(AND(SUM($G$92:G262)>0,G263>0),\", \",\"\")","v":""},"",null,null,null,null,null,null,""]
[null,null,26,null,null,"gelb",{"$f":"COUNTIF(Kugeln!$X$4:$X$52,CONCATENATE(\"(\",Ergebnismenge!C264,\", \",F264,\")\"))","v":0},null,null,null,null,null,null,{"$f":"IF(AND(SUM($G$92:G263)>0,G264>0),\", \",\"\")","v":""},"",null,null,null,null,null,null,""]
[null,null,27,null,null,"gelb",{"$f":"COUNTIF(Kugeln!$X$4:$X$52,CONCATENATE(\"(\",Ergebnismenge!C265,\", \",F265,\")\"))","v":0},null,null,null,null,null,null,{"$f":"IF(AND(SUM($G$92:G264)>0,G265>0),\", \",\"\")","v":""},"",null,null,null,null,null,null,""]
[null,null,28,null,null,"gelb",{"$f":"COUNTIF(Kugeln!$X$4:$X$52,CONCATENATE(\"(\",Ergebnismenge!C266,\", \",F266,\")\"))","v":0},null,null,null,null,null,null,{"$f":"IF(AND(SUM($G$92:G265)>0,G266>0),\", \",\"\")","v":""},"",null,null,null,null,null,null,""]
[null,null,29,null,null,"gelb",{"$f":"COUNTIF(Kugeln!$X$4:$X$52,CONCATENATE(\"(\",Ergebnismenge!C267,\", \",F267,\")\"))","v":0},null,null,null,null,null,null,{"$f":"IF(AND(SUM($G$92:G266)>0,G267>0),\", \",\"\")","v":""},"",null,null,null,null,null,null,""]
[null,null,30,null,null,"gelb",{"$f":"COUNTIF(Kugeln!$X$4:$X$52,CONCATENATE(\"(\",Ergebnismenge!C268,\", \",F268,\")\"))","v":0},null,null,null,null,null,null,{"$f":"IF(AND(SUM($G$92:G267)>0,G268>0),\", \",\"\")","v":""},"",null,null,null,null,null,null,""]
[null,null,31,null,null,"gelb",{"$f":"COUNTIF(Kugeln!$X$4:$X$52,CONCATENATE(\"(\",Ergebnismenge!C269,\", \",F269,\")\"))","v":0},null,null,null,null,null,null,{"$f":"IF(AND(SUM($G$92:G268)>0,G269>0),\", \",\"\")","v":""},"",null,null,null,null,null,null,""]
[null,null,32,null,null,"gelb",{"$f":"COUNTIF(Kugeln!$X$4:$X$52,CONCATENATE(\"(\",Ergebnismenge!C270,\", \",F270,\")\"))","v":0},null,null,null,null,null,null,{"$f":"IF(AND(SUM($G$92:G269)>0,G270>0),\", \",\"\")","v":""},"",null,null,null,null,null,null,""]
[null,null,33,null,null,"gelb",{"$f":"COUNTIF(Kugeln!$X$4:$X$52,CONCATENATE(\"(\",Ergebnismenge!C271,\", \",F271,\")\"))","v":0},null,null,null,null,null,null,{"$f":"IF(AND(SUM($G$92:G270)>0,G271>0),\", \",\"\")","v":""},"",null,null,null,null,null,null,""]
[null,null,34,null,null,"gelb",{"$f":"COUNTIF(Kugeln!$X$4:$X$52,CONCATENATE(\"(\",Ergebnismenge!C272,\", \",F272,\")\"))","v":0},null,null,null,null,null,null,{"$f":"IF(AND(SUM($G$92:G271)>0,G272>0),\", \",\"\")","v":""},"",null,null,null,null,null,null,""]
[null,null,35,null,null,"gelb",{"$f":"COUNTIF(Kugeln!$X$4:$X$52,CONCATENATE(\"(\",Ergebnismenge!C273,\", \",F273,\")\"))","v":0},null,null,null,null,null,null,{"$f":"IF(AND(SUM($G$92:G272)>0,G273>0),\", \",\"\")","v":""},"",null,null,null,null,null,null,""]
[null,null,36,null,null,"gelb",{"$f":"COUNTIF(Kugeln!$X$4:$X$52,CONCATENATE(\"(\",Ergebnismenge!C274,\", \",F274,\")\"))","v":0},null,null,null,null,null,null,{"$f":"IF(AND(SUM($G$92:G273)>0,G274>0),\", \",\"\")","v":""},"",null,null,null,null,null,null,""]
[null,null,37,null,null,"gelb",{"$f":"COUNTIF(Kugeln!$X$4:$X$52,CONCATENATE(\"(\",Ergebnismenge!C275,\", \",F275,\")\"))","v":0},null,null,null,null,null,null,{"$f":"IF(AND(SUM($G$92:G274)>0,G275>0),\", \",\"\")","v":""},"",null,null,null,null,null,null,""]
[null,null,38,null,null,"gelb",{"$f":"COUNTIF(Kugeln!$X$4:$X$52,CONCATENATE(\"(\",Ergebnismenge!C276,\", \",F276,\")\"))","v":0},null,null,null,null,null,null,{"$f":"IF(AND(SUM($G$92:G275)>0,G276>0),\", \",\"\")","v":""},"",null,null,null,null,null,null,""]
[null,null,39,null,null,"gelb",{"$f":"COUNTIF(Kugeln!$X$4:$X$52,CONCATENATE(\"(\",Ergebnismenge!C277,\", \",F277,\")\"))","v":0},null,null,null,null,null,null,{"$f":"IF(AND(SUM($G$92:G276)>0,G277>0),\", \",\"\")","v":""},"",null,null,null,null,null,null,""]
[null,null,40,null,null,"gelb",{"$f":"COUNTIF(Kugeln!$X$4:$X$52,CONCATENATE(\"(\",Ergebnismenge!C278,\", \",F278,\")\"))","v":0},null,null,null,null,null,null,{"$f":"IF(AND(SUM($G$92:G277)>0,G278>0),\", \",\"\")","v":""},"",null,null,null,null,null,null,""]
[null,null,41,null,null,"gelb",{"$f":"COUNTIF(Kugeln!$X$4:$X$52,CONCATENATE(\"(\",Ergebnismenge!C279,\", \",F279,\")\"))","v":0},null,null,null,null,null,null,{"$f":"IF(AND(SUM($G$92:G278)>0,G279>0),\", \",\"\")","v":""},"",null,null,null,null,null,null,""]
[null,null,42,null,null,"gelb",{"$f":"COUNTIF(Kugeln!$X$4:$X$52,CONCATENATE(\"(\",Ergebnismenge!C280,\", \",F280,\")\"))","v":0},null,null,null,null,null,null,{"$f":"IF(AND(SUM($G$92:G279)>0,G280>0),\", \",\"\")","v":""},"",null,null,null,null,null,null,""]
[null,null,43,null,null,"gelb",{"$f":"COUNTIF(Kugeln!$X$4:$X$52,CONCATENATE(\"(\",Ergebnismenge!C281,\", \",F281,\")\"))","v":0},null,null,null,null,null,null,{"$f":"IF(AND(SUM($G$92:G280)>0,G281>0),\", \",\"\")","v":""},"",null,null,null,null,null,null,""]
[null,null,44,null,null,"gelb",{"$f":"COUNTIF(Kugeln!$X$4:$X$52,CONCATENATE(\"(\",Ergebnismenge!C282,\", \",F282,\")\"))","v":0},null,null,null,null,null,null,{"$f":"IF(AND(SUM($G$92:G281)>0,G282>0),\", \",\"\")","v":""},"",null,null,null,null,null,null,""]
[null,null,45,null,null,"gelb",{"$f":"COUNTIF(Kugeln!$X$4:$X$52,CONCATENATE(\"(\",Ergebnismenge!C283,\", \",F283,\")\"))","v":0},null,null,null,null,null,null,{"$f":"IF(AND(SUM($G$92:G282)>0,G283>0),\", \",\"\")","v":""},"",null,null,null,null,null,null,""]
[null,null,46,null,null,"gelb",{"$f":"COUNTIF(Kugeln!$X$4:$X$52,CONCATENATE(\"(\",Ergebnismenge!C284,\", \",F284,\")\"))","v":0},null,null,null,null,null,null,{"$f":"IF(AND(SUM($G$92:G283)>0,G284>0),\", \",\"\")","v":""},"",null,null,null,null,null,null,""]
[null,null,47,null,null,"gelb",{"$f":"COUNTIF(Kugeln!$X$4:$X$52,CONCATENATE(\"(\",Ergebnismenge!C285,\", \",F285,\")\"))","v":0},null,null,null,null,null,null,{"$f":"IF(AND(SUM($G$92:G284)>0,G285>0),\", \",\"\")","v":""},"",null,null,null,null,null,null,""]
[null,null,48,null,null,"gelb",{"$f":"COUNTIF(Kugeln!$X$4:$X$52,CONCATENATE(\"(\",Ergebnismenge!C286,\", \",F286,\")\"))","v":0},null,null,null,null,null,null,{"$f":"IF(AND(SUM($G$92:G285)>0,G286>0),\", \",\"\")","v":""},"",null,null,null,null,null,null,""]
[null,null,49,null,null,"gelb",{"$f":"COUNTIF(Kugeln!$X$4:$X$52,CONCATENATE(\"(\",Ergebnismenge!C287,\", \",F287,\")\"))","v":0},null,null,null,null,null,null,{"$f":"IF(AND(SUM($G$92:G286)>0,G287>0),\", \",\"\")","v":""},{"$f":"IF(G287>0,CONCATENATE(\"(\",F287,\", \",C287,\")\"),\"\")","v":""},null,null,null,null,null,null,""]
[null,null,1,null,null,"grau",{"$f":"COUNTIF(Kugeln!$X$4:$X$52,CONCATENATE(\"(\",Ergebnismenge!C288,\", \",F288,\")\"))","v":0},null,null,null,null,null,null,{"$f":"IF(AND(SUM($G$92:G287)>0,G288>0),\", \",\"\")","v":""},"",null,null,null,null,null,null,""]
[null,null,2,null,null,"grau",{"$f":"COUNTIF(Kugeln!$X$4:$X$52,CONCATENATE(\"(\",Ergebnismenge!C289,\", \",F289,\")\"))","v":4},null,null,null,null,null,null,{"$f":"IF(AND(SUM($G$92:G288)>0,G289>0),\", \",\"\")","v":", "},"(grau, 2)",null,null,null,null,null,null,{"$f":"CONCATENATE(N289,O289)","v":", (grau, 2)"}]
[null,null,3,null,null,"grau",{"$f":"COUNTIF(Kugeln!$X$4:$X$52,CONCATENATE(\"(\",Ergebnismenge!C290,\", \",F290,\")\"))","v":1},null,null,null,null,null,null,{"$f":"IF(AND(SUM($G$92:G289)>0,G290>0),\", \",\"\")","v":", "},"(grau, 3)",null,null,null,null,null,null,", (grau, 3)"]
[null,null,4,null,null,"grau",{"$f":"COUNTIF(Kugeln!$X$4:$X$52,CONCATENATE(\"(\",Ergebnismenge!C291,\", \",F291,\")\"))","v":1},null,null,null,null,null,null,{"$f":"IF(AND(SUM($G$92:G290)>0,G291>0),\", \",\"\")","v":", "},"(grau, 4)",null,null,null,null,null,null,", (grau, 4)"]
[null,null,5,null,null,"grau",{"$f":"COUNTIF(Kugeln!$X$4:$X$52,CONCATENATE(\"(\",Ergebnismenge!C292,\", \",F292,\")\"))","v":2},null,null,null,null,null,null,{"$f":"IF(AND(SUM($G$92:G291)>0,G292>0),\", \",\"\")","v":", "},"(grau, 5)",null,null,null,null,null,null,", (grau, 5)"]
[null,null,6,null,null,"grau",{"$f":"COUNTIF(Kugeln!$X$4:$X$52,CONCATENATE(\"(\",Ergebnismenge!C293,\", \",F293,\")\"))","v":1},null,null,null,null,null,null,{"$f":"IF(AND(SUM($G$92:G292)>0,G293>0),\", \",\"\")","v":", "},"(grau, 6)",null,null,null,null,null,null,", (grau, 6)"]
[null,null,7,null,null,"grau",{"$f":"COUNTIF(Kugeln!$X$4:$X$52,CONCATENATE(\"(\",Ergebnismenge!C294,\", \",F294,\")\"))","v":2},null,null,null,null,null,null,{"$f":"IF(AND(SUM($G$92:G293)>0,G294>0),\", \",\"\")","v":", "},"(grau, 7)",null,null,null,null,null,null,", (grau, 7)"]
[null,null,8,null,null,"grau",{"$f":"COUNTIF(Kugeln!$X$4:$X$52,CONCATENATE(\"(\",Ergebnismenge!C295,\", \",F295,\")\"))","v":1},null,null,null,null,null,null,{"$f":"IF(AND(SUM($G$92:G294)>0,G295>0),\", \",\"\")","v":", "},"(grau, 8)",null,null,null,null,null,null,", (grau, 8)"]
[null,null,9,null,null,"grau",{"$f":"COUNTIF(Kugeln!$X$4:$X$52,CONCATENATE(\"(\",Ergebnismenge!C296,\", \",F296,\")\"))","v":0},null,null,null,null,null,null,{"$f":"IF(AND(SUM($G$92:G295)>0,G296>0),\", \",\"\")","v":""},"",null,null,null,null,null,null,""]
[null,null,10,null,null,"grau",{"$f":"COUNTIF(Kugeln!$X$4:$X$52,CONCATENATE(\"(\",Ergebnismenge!C297,\", \",F297,\")\"))","v":0},null,null,null,null,null,null,{"$f":"IF(AND(SUM($G$92:G296)>0,G297>0),\", \",\"\")","v":""},"",null,null,null,null,null,null,""]
[null,null,11,null,null,"grau",{"$f":"COUNTIF(Kugeln!$X$4:$X$52,CONCATENATE(\"(\",Ergebnismenge!C298,\", \",F298,\")\"))","v":0},null,null,null,null,null,null,{"$f":"IF(AND(SUM($G$92:G297)>0,G298>0),\", \",\"\")","v":""},"",null,null,null,null,null,null,""]
[null,null,12,null,null,"grau",{"$f":"COUNTIF(Kugeln!$X$4:$X$52,CONCATENATE(\"(\",Ergebnismenge!C299,\", \",F299,\")\"))","v":0},null,null,null,null,null,null,{"$f":"IF(AND(SUM($G$92:G298)>0,G299>0),\", \",\"\")","v":""},"",null,null,null,null,null,null,""]
[null,null,13,null,null,"grau",{"$f":"COUNTIF(Kugeln!$X$4:$X$52,CONCATENATE(\"(\",Ergebnismenge!C300,\", \",F300,\")\"))","v":0},null,null,null,null,null,null,{"$f":"IF(AND(SUM($G$92:G299)>0,G300>0),\", \",\"\")","v":""},"",null,null,null,null,null,null,""]
[null,null,14,null,null,"grau",{"$f":"COUNTIF(Kugeln!$X$4:$X$52,CONCATENATE(\"(\",Ergebnismenge!C301,\", \",F301,\")\"))","v":0},null,null,null,null,null,null,{"$f":"IF(AND(SUM($G$92:G300)>0,G301>0),\", \",\"\")","v":""},"",null,null,null,null,null,null,""]
[null,null,15,null,null,"grau",{"$f":"COUNTIF(Kugeln!$X$4:$X$52,CONCATENATE(\"(\",Ergebnismenge!C302,\", \",F302,\")\"))","v":0},null,null,null,null,null,null,{"$f":"IF(AND(SUM($G$92:G301)>0,G302>0),\", \",\"\")","v":""},"",null,null,null,null,null,null,""]
[null,null,16,null,null,"grau",{"$f":"COUNTIF(Kugeln!$X$4:$X$52,CONCATENATE(\"(\",Ergebnismenge!C303,\", \",F303,\")\"))","v":0},null,null,null,null,null,null,{"$f":"IF(AND(SUM($G$92:G302)>0,G303>0),\", \",\"\")","v":""},"",null,null,null,null,null,null,""]
[null,null,17,null,null,"grau",{"$f":"COUNTIF(Kugeln!$X$4:$X$52,CONCATENATE(\"(\",Ergebnismenge!C304,\", \",F304,\")\"))","v":0},null,null,null,null,null,null,{"$f":"IF(AND(SUM($G$92:G303)>0,G304>0),\", \",\"\")","v":""},"",null,null,null,null,null,null,""]
[null,null,18,null,null,"grau",{"$f":"COUNTIF(Kugeln!$X$4:$X$52,CONCATENATE(\"(\",Ergebnismenge!C305,\", \",F305,\")\"))","v":0},null,null,null,null,null,null,{"$f":"IF(AND(SUM($G$92:G304)>0,G305>0),\", \",\"\")","v":""},"",null,null,null,null,null,null,""]
[null,null,19,null,null,"grau",{"$f":"COUNTIF(Kugeln!$X$4:$X$52,CONCATENATE(\"(\",Ergebnismenge!C306,\", \",F306,\")\"))","v":0},null,null,null,null,null,null,{"$f":"IF(AND(SUM($G$92:G305)>0,G306>0),\", \",\"\")","v":""},"",null,null,null,null,null,null,""]
[null,null,20,null,null,"grau",{"$f":"COUNTIF(Kugeln!$X$4:$X$52,CONCATENATE(\"(\",Ergebnismenge!C307,\", \",F307,\")\"))","v":0},null,null,null,null,null,null,{"$f":"IF(AND(SUM($G$92:G306)>0,G307>0),\", \",\"\")","v":""},"",null,null,null,null,null,null,""]
[null,null,21,null,null,"grau",{"$f":"COUNTIF(Kugeln!$X$4:$X$52,CONCATENATE(\"(\",Ergebnismenge!C308,\", \",F308,\")\"))","v":0},null,null,null,null,null,null,{"$f":"IF(AND(SUM($G$92:G307)>0,G308>0),\", \",\"\")","v":""},"",null,null,null,null,null,null,""]
[null,null,22,null,null,"grau",{"$f":"COUNTIF(Kugeln!$X$4:$X$52,CONCATENATE(\"(\",Ergebnismenge!C309,\", \",F309,\")\"))","v":0},null,null,null,null,null,null,{"$f":"IF(AND(SUM($G$92:G308)>0,G309>0),\", \",\"\")","v":""},"",null,null,null,null,null,null,""]
[null,null,23,null,null,"grau",{"$f":"COUNTIF(Kugeln!$X$4:$X$52,CONCATENATE(\"(\",Ergebnismenge!C310,\", \",F310,\")\"))","v":0},null,null,null,null,null,null,{"$f":"IF(AND(SUM($G$92:G309)>0,G310>0),\", \",\"\")","v":""},"",null,null,null,null,null,null,""]
[null,null,24,null,null,"grau",{"$f":"COUNTIF(Kugeln!$X$4:$X$52,CONCATENATE(\"(\",Ergebnismenge!C311,\", \",F311,\")\"))","v":0},null,null,null,null,null,null,{"$f":"IF(AND(SUM($G$92:G310)>0,G311>0),\", \",\"\")","v":""},"",null,null,null,null,null,null,""]
[null,null,25,null,null,"grau",{"$f":"COUNTIF(Kugeln!$X$4:$X$52,CONCATENATE(\"(\",Ergebnismenge!C312,\", \",F312,\")\"))","v":0},null,null,null,null,null,null,{"$f":"IF(AND(SUM($G$92:G311)>0,G312>0),\", \",\"\")","v":""},"",null,null,null,null,null,null,""]
[null,null,26,null,null,"grau",{"$f":"COUNTIF(Kugeln!$X$4:$X$52,CONCATENATE(\"(\",Ergebnismenge!C313,\", \",F313,\")\"))","v":0},null,null,null,null,null,null,{"$f":"IF(AND(SUM($G$92:G312)>0,G313>0),\", \",\"\")","v":""},"",null,null,null,null,null,null,""]
[null,null,27,null,null,"grau",{"$f":"COUNTIF(Kugeln!$X$4:$X$52,CONCATENATE(\"(\",Ergebnismenge!C314,\", \",F314,\")\"))","v":0},null,null,null,null,null,null,{"$f":"IF(AND(SUM($G$92:G313)>0,G314>0),\", \",\"\")","v":""},"",null,null,null,null,null,null,""]
[null,null,28,null,null,"grau",{"$f":"COUNTIF(Kugeln!$X$4:$X$52,CONCATENATE(\"(\",Ergebnismenge!C315,\", \",F315,\")\"))","v":0},null,null,null,null,null,null,{"$f":"IF(AND(SUM($G$92:G314)>0,G315>0),\", \",\"\")","v":""},"",null,null,null,null,null,null,""]
[null,null,29,null,null,"grau",{"$f":"COUNTIF(Kugeln!$X$4:$X$52,CONCATENATE(\"(\",Ergebnismenge!C316,\", \",F316,\")\"))","v":0},null,null,null,null,null,null,{"$f":"IF(AND(SUM($G$92:G315)>0,G316>0),\", \",\"\")","v":""},"",null,null,null,null,null,null,""]
[null,null,30,null,null,"grau",{"$f":"COUNTIF(Kugeln!$X$4:$X$52,CONCATENATE(\"(\",Ergebnismenge!C317,\", \",F317,\")\"))","v":0},null,null,null,null,null,null,{"$f":"IF(AND(SUM($G$92:G316)>0,G317>0),\", \",\"\")","v":""},"",null,null,null,null,null,null,""]
[null,null,31,null,null,"grau",{"$f":"COUNTIF(Kugeln!$X$4:$X$52,CONCATENATE(\"(\",Ergebnismenge!C318,\", \",F318,\")\"))","v":0},null,null,null,null,null,null,{"$f":"IF(AND(SUM($G$92:G317)>0,G318>0),\", \",\"\")","v":""},"",null,null,null,null,null,null,""]
[null,null,32,null,null,"grau",{"$f":"COUNTIF(Kugeln!$X$4:$X$52,CONCATENATE(\"(\",Ergebnismenge!C319,\", \",F319,\")\"))","v":0},null,null,null,null,null,null,{"$f":"IF(AND(SUM($G$92:G318)>0,G319>0),\", \",\"\")","v":""},"",null,null,null,null,null,null,""]
[null,null,33,null,null,"grau",{"$f":"COUNTIF(Kugeln!$X$4:$X$52,CONCATENATE(\"(\",Ergebnismenge!C320,\", \",F320,\")\"))","v":0},null,null,null,null,null,null,{"$f":"IF(AND(SUM($G$92:G319)>0,G320>0),\", \",\"\")","v":""},"",null,null,null,null,null,null,""]
[null,null,34,null,null,"grau",{"$f":"COUNTIF(Kugeln!$X$4:$X$52,CONCATENATE(\"(\",Ergebnismenge!C321,\", \",F321,\")\"))","v":0},null,null,null,null,null,null,{"$f":"IF(AND(SUM($G$92:G320)>0,G321>0),\", \",\"\")","v":""},"",null,null,null,null,null,null,""]
[null,null,35,null,null,"grau",{"$f":"COUNTIF(Kugeln!$X$4:$X$52,CONCATENATE(\"(\",Ergebnismenge!C322,\", \",F322,\")\"))","v":0},null,null,null,null,null,null,{"$f":"IF(AND(SUM($G$92:G321)>0,G322>0),\", \",\"\")","v":""},"",null,null,null,null,null,null,""]
[null,null,36,null,null,"grau",{"$f":"COUNTIF(Kugeln!$X$4:$X$52,CONCATENATE(\"(\",Ergebnismenge!C323,\", \",F323,\")\"))","v":0},null,null,null,null,null,null,{"$f":"IF(AND(SUM($G$92:G322)>0,G323>0),\", \",\"\")","v":""},"",null,null,null,null,null,null,""]
[null,null,37,null,null,"grau",{"$f":"COUNTIF(Kugeln!$X$4:$X$52,CONCATENATE(\"(\",Ergebnismenge!C324,\", \",F324,\")\"))","v":0},null,null,null,null,null,null,{"$f":"IF(AND(SUM($G$92:G323)>0,G324>0),\", \",\"\")","v":""},"",null,null,null,null,null,null,""]
[null,null,38,null,null,"grau",{"$f":"COUNTIF(Kugeln!$X$4:$X$52,CONCATENATE(\"(\",Ergebnismenge!C325,\", \",F325,\")\"))","v":0},null,null,null,null,null,null,{"$f":"IF(AND(SUM($G$92:G324)>0,G325>0),\", \",\"\")","v":""},"",null,null,null,null,null,null,""]
[null,null,39,null,null,"grau",{"$f":"COUNTIF(Kugeln!$X$4:$X$52,CONCATENATE(\"(\",Ergebnismenge!C326,\", \",F326,\")\"))","v":0},null,null,null,null,null,null,{"$f":"IF(AND(SUM($G$92:G325)>0,G326>0),\", \",\"\")","v":""},"",null,null,null,null,null,null,""]
[null,null,40,null,null,"grau",{"$f":"COUNTIF(Kugeln!$X$4:$X$52,CONCATENATE(\"(\",Ergebnismenge!C327,\", \",F327,\")\"))","v":0},null,null,null,null,null,null,{"$f":"IF(AND(SUM($G$92:G326)>0,G327>0),\", \",\"\")","v":""},"",null,null,null,null,null,null,""]
[null,null,41,null,null,"grau",{"$f":"COUNTIF(Kugeln!$X$4:$X$52,CONCATENATE(\"(\",Ergebnismenge!C328,\", \",F328,\")\"))","v":0},null,null,null,null,null,null,{"$f":"IF(AND(SUM($G$92:G327)>0,G328>0),\", \",\"\")","v":""},"",null,null,null,null,null,null,""]
[null,null,42,null,null,"grau",{"$f":"COUNTIF(Kugeln!$X$4:$X$52,CONCATENATE(\"(\",Ergebnismenge!C329,\", \",F329,\")\"))","v":0},null,null,null,null,null,null,{"$f":"IF(AND(SUM($G$92:G328)>0,G329>0),\", \",\"\")","v":""},"",null,null,null,null,null,null,""]
[null,null,43,null,null,"grau",{"$f":"COUNTIF(Kugeln!$X$4:$X$52,CONCATENATE(\"(\",Ergebnismenge!C330,\", \",F330,\")\"))","v":0},null,null,null,null,null,null,{"$f":"IF(AND(SUM($G$92:G329)>0,G330>0),\", \",\"\")","v":""},"",null,null,null,null,null,null,""]
[null,null,44,null,null,"grau",{"$f":"COUNTIF(Kugeln!$X$4:$X$52,CONCATENATE(\"(\",Ergebnismenge!C331,\", \",F331,\")\"))","v":0},null,null,null,null,null,null,{"$f":"IF(AND(SUM($G$92:G330)>0,G331>0),\", \",\"\")","v":""},"",null,null,null,null,null,null,""]
[null,null,45,null,null,"grau",{"$f":"COUNTIF(Kugeln!$X$4:$X$52,CONCATENATE(\"(\",Ergebnismenge!C332,\", \",F332,\")\"))","v":0},null,null,null,null,null,null,{"$f":"IF(AND(SUM($G$92:G331)>0,G332>0),\", \",\"\")","v":""},"",null,null,null,null,null,null,""]
[null,null,46,null,null,"grau",{"$f":"COUNTIF(Kugeln!$X$4:$X$52,CONCATENATE(\"(\",Ergebnismenge!C333,\", \",F333,\")\"))","v":0},null,null,null,null,null,null,{"$f":"IF(AND(SUM($G$92:G332)>0,G333>0),\", \",\"\")","v":""},"",null,null,null,null,null,null,""]
[null,null,47,null,null,"grau",{"$f":"COUNTIF(Kugeln!$X$4:$X$52,CONCATENATE(\"(\",Ergebnismenge!C334,\", \",F334,\")\"))","v":0},null,null,null,null,null,null,{"$f":"IF(AND(SUM($G$92:G333)>0,G334>0),\", \",\"\")","v":""},"",null,null,null,null,null,null,""]
[null,null,48,null,null,"grau",{"$f":"COUNTIF(Kugeln!$X$4:$X$52,CONCATENATE(\"(\",Ergebnismenge!C335,\", \",F335,\")\"))","v":0},null,null,null,null,null,null,{"$f":"IF(AND(SUM($G$92:G334)>0,G335>0),\", \",\"\")","v":""},"",null,null,null,null,null,null,""]
[null,null,49,null,null,"grau",{"$f":"COUNTIF(Kugeln!$X$4:$X$52,CONCATENATE(\"(\",Ergebnismenge!C336,\", \",F336,\")\"))","v":0},null,null,null,null,null,null,{"$f":"IF(AND(SUM($G$92:G335)>0,G336>0),\", \",\"\")","v":""},"",null,null,null,null,null,null,""]
[]
[null,null,"Anzahl",null,null,null,{"$f":"SUM(G92:G336)","v":49}]
[]
[null,null,"|Ω| =",null,null,null,{"$f":"COUNTIF(G92:G336,\">0\")","v":31}]

{"sheet":"Ergebnis-W.","index":2,"n_rows":347,"n_cols":45,"rows_kept":347,"cut":false,"hidden":false,"merged":[[16,41,17,42],[12,30,13,31],[15,30,16,31],[18,30,19,31],[21,30,22,31],[12,40,13,40],[21,38,22,38],[12,36,13,36],[12,37,13,37],[15,36,16,36],[15,37,16,37],[18,36,19,36],[18,37,19,37],[27,39,28,39],[12,34,13,34],[15,34,16,34],[18,34,19,34],[21,34,22,34],[24,34,25,34],[27,34,28,34],[12,39,13,39],[15,39,16,39],[18,39,19,39],[21,39,22,39],[24,39,25,39],[12,38,13,38],[15,38,16,38],[18,38,19,38],[24,38,25,38],[27,38,28,38],[21,36,22,36],[21,37,22,37],[24,36,25,36],[24,37,25,37],[27,36,28,36],[27,37,28,37],[27,30,28,32],[27,33,28,33],[12,29,13,29],[15,29,16,29],[18,29,19,29],[21,29,22,29],[24,29,25,29],[27,29,28,29],[12,33,13,33],[15,33,16,33],[18,33,19,33],[21,33,22,33],[24,33,25,33],[24,30,25,31]]}
[]
[]
[null,"Gefäß mit Kugeln: ",null,null,null,null,null,null,null,{"$f":"Kugeln!Y54","v":49},"Stück",null,null,null,null,null,null,null,null,null,null,null,null,null,null,null,null,null,null,"Ergebnis-Wahrscheinlichkeiten",null,null,null,null,null,null,null,null,null,null,null,false]
[]
[null,null,{"$f":"Kugeln!Z4","v":"grün"},1,null,null,{"$f":"Kugeln!Z11","v":"grün"},8,null,null,{"$f":"Kugeln!Z18","v":"gelb"},15,null,null,{"$f":"Kugeln!Z25","v":"rot"},22,null,null,{"$f":"Kugeln!Z32","v":"rot"},29,null,null,{"$f":"Kugeln!Z39","v":"blau"},36,null,null,{"$f":"Kugeln!Z46","v":"blau"},43,null,"1.  Es wird 1-mal gezogen, Beobachtungskriterium: Farbe"]
[]
[null,null,{"$f":"Kugeln!Z5","v":"grün"},2,null,null,{"$f":"Kugeln!Z12","v":"gelb"},9,null,null,{"$f":"Kugeln!Z19","v":"gelb"},16,null,null,{"$f":"Kugeln!Z26","v":"grau"},23,null,null,{"$f":"Kugeln!Z33","v":"gelb"},30,null,null,{"$f":"Kugeln!Z40","v":"grau"},37,null,null,{"$f":"Kugeln!Z47","v":"grau"},44,null,"Ω   =",{"$f":"CONCATENATE(\"{\",V37,V38,V39,V40,V41,\"}\")","v":"{rot, grün, blau, gelb, grau}"}]
[]
[null,null,{"$f":"Kugeln!Z6","v":"grün"},3,null,null,{"$f":"Kugeln!Z13","v":"gelb"},10,null,null,{"$f":"Kugeln!Z20","v":"rot"},17,null,null,{"$f":"Kugeln!Z27","v":"grün"},24,null,null,{"$f":"Kugeln!Z34","v":"grau"},31,null,null,{"$f":"Kugeln!Z41","v":"grün"},38,null,null,{"$f":"Kugeln!Z48","v":"grün"},45,null,"|Ω| =",{"$f":"G42","v":5}]
[]
[null,null,{"$f":"Kugeln!Z7","v":"grau"},4,null,null,{"$f":"Kugeln!Z14","v":"grün"},11,null,null,{"$f":"Kugeln!Z21","v":"grau"},18,null,null,{"$f":"Kugeln!Z28","v":"grau"},25,null,null,{"$f":"Kugeln!Z35","v":"blau"},32,null,null,{"$f":"Kugeln!Z42","v":"grün"},39,null,null,{"$f":"Kugeln!Z49","v":"grün"},46]
[]
[null,null,{"$f":"Kugeln!Z8","v":"grün"},5,null,null,{"$f":"Kugeln!Z15","v":"grau"},12,null,null,{"$f":"Kugeln!Z22","v":"blau"},19,null,null,{"$f":"Kugeln!Z29","v":"blau"},26,null,null,{"$f":"Kugeln!Z36","v":"rot"},33,null,null,{"$f":"Kugeln!Z43","v":"rot"},40,null,null,{"$f":"Kugeln!Z50","v":"grau"},47,null,{"$f":"G37","v":6},"rote Kugeln",null,null,"P(rot)","=",{"$f":"AD13","v":6},"≅",{"$f":"AJ13/AJ14","v":0.12244897959183673},"≅",{"$f":"AL13","v":0.12244897959183673}]
[null,null,null,null,null,null,null,null,null,null,null,null,null,null,null,null,null,null,null,null,null,null,null,null,null,null,null,null,null,null,null,null,null,null,null,{"$f":"$AD$28","v":49},null,null,null,null,null,null,null,null,{"$f":"IF(OR(AL13=0,AL13=MAX($AL$13:$AL$26)),1,0)","v":0}]
[null,null,{"$f":"Kugeln!Z9","v":"gelb"},6,null,null,{"$f":"Kugeln!Z16","v":"grau"},13,null,null,{"$f":"Kugeln!Z23","v":"gelb"},20,null,null,{"$f":"Kugeln!Z30","v":"grün"},27,null,null,{"$f":"Kugeln!Z37","v":"grün"},34,null,null,{"$f":"Kugeln!Z44","v":"rot"},41,null,null,{"$f":"Kugeln!Z51","v":"gelb"},48]
[null,null,null,null,null,null,null,null,null,null,null,null,null,null,null,null,null,null,null,null,null,null,null,null,null,null,null,null,null,{"$f":"G38","v":15},"grüne Kugeln",null,null,"P(grün)","=",{"$f":"AD16","v":15},"≅",{"$f":"AJ16/AJ17","v":0.30612244897959184},"≅",{"$f":"AL16","v":0.30612244897959184}]
[null,null,{"$f":"Kugeln!Z10","v":"blau"},7,null,null,{"$f":"Kugeln!Z17","v":"grau"},14,null,null,{"$f":"Kugeln!Z24","v":"grün"},21,null,null,{"$f":"Kugeln!Z31","v":"grau"},28,null,null,{"$f":"Kugeln!Z38","v":"grün"},35,null,null,{"$f":"Kugeln!Z45","v":"gelb"},42,null,null,{"$f":"Kugeln!Z52","v":"blau"},49,null,null,null,null,null,null,null,{"$f":"$AD$28","v":49},null,null,null,null,null,"Alle Ergebnisse gleichwahrscheinlich:",null,null,{"$f":"IF(OR(AL16=0,AL16=MAX($AL$13:$AL$26)),1,0)","v":1}]
[null,null,null,null,null,null,null,null,null,null,null,null,null,null,null,null,null,null,null,null,null,null,null,null,null,null,null,null,null,null,null,null,null,null,null,null,null,null,null,null,null,null,null,{"$f":"IF(SUM(AS14:AS26)=5,\"ja\",\"nein\")","v":"nein"}]
[null,null,null,null,false,null,null,null,null,null,null,null,null,null,null,null,null,null,null,null,null,null,null,null,null,null,null,null,null,{"$f":"G39","v":7},"blaue Kugeln",null,null,"P(blau)","=",{"$f":"AD19","v":7},"≅",{"$f":"AJ19/AJ20","v":0.14285714285714285},"≅",{"$f":"AL19","v":0.14285714285714285}]
[null,null,null,null,null,null,null,null,null,null,null,null,null,null,null,null,null,null,null,null,null,null,null,null,null,null,null,null,null,null,null,null,null,null,null,{"$f":"$AD$28","v":49},null,null,null,null,null,null,null,null,0]
[null,null,null,null,null,null,null,null,null,null,null,null,null,null,null,null,null,null,null,null,null,null,null,null,null,null,null,null,null,null,null,null,null,null,null,null,null,null,null,null,null,"⇒",{"$f":"IF(AR18=\"ja\",\"Laplace-Experiment\", \"KEIN Laplace-Experiment\")","v":"KEIN Laplace-Experiment"}]
[null,null,null,null,null,null,null,null,null,null,null,null,null,null,null,null,null,null,null,null,null,null,null,null,null,null,null,null,null,{"$f":"G40","v":9},"gelbe Kugeln",null,null,"P(gelb)","=",{"$f":"AD22","v":9},"≅",{"$f":"AJ22/AJ23","v":0.18367346938775511},"≅",{"$f":"AL22","v":0.18367346938775511}]
[null,null,null,null,null,null,null,null,null,null,null,null,null,null,null,null,null,null,null,null,null,null,null,null,null,null,null,null,null,null,null,null,null,null,null,{"$f":"$AD$28","v":49},null,null,null,null,null,null,null,null,0]
[]
[null,null,null,null,null,null,null,null,null,null,null,null,null,null,null,null,null,null,null,null,null,null,null,null,null,null,null,null,null,{"$f":"G41","v":12},"graue Kugeln",null,null,"P(grau)","=",{"$f":"AD25","v":12},"≅",{"$f":"AJ25/AJ26","v":0.24489795918367346},"≅",{"$f":"AL25","v":0.24489795918367346}]
[null,null,null,null,null,null,null,null,null,null,null,null,null,null,null,null,null,null,null,null,null,null,null,null,null,null,null,null,null,null,null,null,null,null,null,{"$f":"$AD$28","v":49},null,null,null,null,null,null,null,null,0]
[]
[null,null,null,null,null,null,null,null,null,null,null,null,null,null,null,null,null,null,null,null,null,null,null,null,null,null,null,null,null,{"$f":"SUM(AD13:AD25)","v":49},"Kugeln (gesamt)",null,null,"P(Ω)","=",{"$f":"AD28","v":49},"≅",{"$f":"AJ28/AJ29","v":1},"≅",{"$f":"AL28","v":1}]
[null,null,null,null,null,null,null,null,null,null,null,null,null,null,null,null,null,null,null,null,null,null,null,null,null,null,null,null,null,null,null,null,null,null,null,{"$f":"$AD$28","v":49}]
[]
[]
[]
[]
[]
[null,"Anzahl Farben:"]
[]
[null,null,"rot",null,null,null,{"$f":"COUNTIF(Kugeln!$Y$4:$Z$52,Ergebnismenge!C30)","v":6},null,null,null,null,null,null,null,{"$f":"IF(G37>0,C37,\"\")","v":"rot"},null,null,null,null,null,null,{"$f":"CONCATENATE(N37,O37)","v":"rot"}]
[null,null,"grün",null,null,null,{"$f":"COUNTIF(Kugeln!$Y$4:$Z$52,Ergebnismenge!C31)","v":15},null,null,null,null,null,null,{"$f":"IF(AND(SUM($G$37:G37)>0,G38>0),\", \",\"\")","v":", "},{"$f":"IF(G38>0,C38,\"\")","v":"grün"},null,null,null,null,null,null,{"$f":"CONCATENATE(N38,O38)","v":", grün"}]
[null,null,"blau",null,null,null,{"$f":"COUNTIF(Kugeln!$Y$4:$Z$52,Ergebnismenge!C32)","v":7},null,null,null,null,null,null,{"$f":"IF(AND(SUM($G$37:G38)>0,G39>0),\", \",\"\")","v":", "},{"$f":"IF(G39>0,C39,\"\")","v":"blau"},null,null,null,null,null,null,", blau"]
[null,null,"gelb",null,null,null,{"$f":"COUNTIF(Kugeln!$Y$4:$Z$52,Ergebnismenge!C33)","v":9},null,null,null,null,null,null,{"$f":"IF(AND(SUM($G$37:G39)>0,G40>0),\", \",\"\")","v":", "},{"$f":"IF(G40>0,C40,\"\")","v":"gelb"},null,null,null,null,null,null,", gelb"]
[null,null,"grau",null,null,null,{"$f":"COUNTIF(Kugeln!$Y$4:$Z$52,Ergebnismenge!C34)","v":12},null,null,null,null,null,null,{"$f":"IF(AND(SUM($G$37:G40)>0,G41>0),\", \",\"\")","v":", "},{"$f":"IF(G41>0,C41,\"\")","v":"grau"},null,null,null,null,null,null,", grau"]
[null,null,"|Ω| =",null,null,null,{"$f":"COUNTIF(G37:G41,\">0\")","v":5}]
[]
[null,"Anzahl Zahlen:"]
[]
[null,null,1,null,null,null,{"$f":"COUNTIF(Kugeln!$Y$4:$Z$52,Ergebnismenge!C39)","v":0},null,null,null,null,null,null,null,{"$f":"IF(G46>0,C46,\"\")","v":""},null,null,null,null,null,null,""]
[null,null,2,null,null,null,{"$f":"COUNTIF(Kugeln!$Y$4:$Z$52,Ergebnismenge!C40)","v":8},null,null,null,null,null,null,{"$f":"IF(AND(SUM($G$46:G46)>0,G47>0),\", \",\"\")","v":""},2,null,null,null,null,null,null,"2"]
[null,null,3,null,null,null,{"$f":"COUNTIF(Kugeln!$Y$4:$Z$52,Ergebnismenge!C41)","v":3},null,null,null,null,null,null,{"$f":"IF(AND(SUM($G$46:G47)>0,G48>0),\", \",\"\")","v":", "},3,null,null,null,null,null,null,", 3"]
[null,null,4,null,null,null,{"$f":"COUNTIF(Kugeln!$Y$4:$Z$52,Ergebnismenge!C42)","v":5},null,null,null,null,null,null,{"$f":"IF(AND(SUM($G$46:G48)>0,G49>0),\", \",\"\")","v":", "},4,null,null,null,null,null,null,", 4"]
[null,null,5,null,null,null,{"$f":"COUNTIF(Kugeln!$Y$4:$Z$52,Ergebnismenge!C43)","v":7},null,null,null,null,null,null,{"$f":"IF(AND(SUM($G$46:G49)>0,G50>0),\", \",\"\")","v":", "},5,null,null,null,null,null,null,", 5"]
[null,null,6,null,null,null,{"$f":"COUNTIF(Kugeln!$Y$4:$Z$52,Ergebnismenge!C44)","v":7},null,null,null,null,null,null,{"$f":"IF(AND(SUM($G$46:G50)>0,G51>0),\", \",\"\")","v":", "},6,null,null,null,null,null,null,", 6"]
[null,null,7,null,null,null,{"$f":"COUNTIF(Kugeln!$Y$4:$Z$52,Ergebnismenge!C45)","v":7},null,null,null,null,null,null,{"$f":"IF(AND(SUM($G$46:G51)>0,G52>0),\", \",\"\")","v":", "},7,null,null,null,null,null,null,", 7"]
[null,null,8,null,null,null,{"$f":"COUNTIF(Kugeln!$Y$4:$Z$52,Ergebnismenge!C46)","v":6},null,null,null,null,null,null,{"$f":"IF(AND(SUM($G$46:G52)>0,G53>0),\", \",\"\")","v":", "},8,null,null,null,null,null,null,", 8"]
[null,null,9,null,null,null,{"$f":"COUNTIF(Kugeln!$Y$4:$Z$52,Ergebnismenge!C47)","v":6},null,null,null,null,null,null,{"$f":"IF(AND(SUM($G$46:G53)>0,G54>0),\", \",\"\")","v":", "},9,null,null,null,null,null,null,", 9"]
[null,null,10,null,null,null,{"$f":"COUNTIF(Kugeln!$Y$4:$Z$52,Ergebnismenge!C48)","v":0},null,null,null,null,null,null,{"$f":"IF(AND(SUM($G$46:G54)>0,G55>0),\", \",\"\")","v":""},"",null,null,null,null,null,null,""]
[null,null,11,null,null,null,{"$f":"COUNTIF(Kugeln!$Y$4:$Z$52,Ergebnismenge!C49)","v":0},null,null,null,null,null,null,{"$f":"IF(AND(SUM($G$46:G55)>0,G56>0),\", \",\"\")","v":""},"",null,null,null,null,null,null,""]
[null,null,12,null,null,null,{"$f":"COUNTIF(Kugeln!$Y$4:$Z$52,Ergebnismenge!C50)","v":0},null,null,null,null,null,null,{"$f":"IF(AND(SUM($G$46:G56)>0,G57>0),\", \",\"\")","v":""},"",null,null,null,null,null,null,""]
[null,null,13,null,null,null,{"$f":"COUNTIF(Kugeln!$Y$4:$Z$52,Ergebnismenge!C51)","v":0},null,null,null,null,null,null,{"$f":"IF(AND(SUM($G$46:G57)>0,G58>0),\", \",\"\")","v":""},"",null,null,null,null,null,null,""]
[null,null,14,null,null,null,{"$f":"COUNTIF(Kugeln!$Y$4:$Z$52,Ergebnismenge!C52)","v":0},null,null,null,null,null,null,{"$f":"IF(AND(SUM($G$46:G58)>0,G59>0),\", \",\"\")","v":""},"",null,null,null,null,null,null,""]
[null,null,15,null,null,null,{"$f":"COUNTIF(Kugeln!$Y$4:$Z$52,Ergebnismenge!C53)","v":0},null,null,null,null,null,null,{"$f":"IF(AND(SUM($G$46:G59)>0,G60>0),\", \",\"\")","v":""},"",null,null,null,null,null,null,""]
[null,null,16,null,null,null,{"$f":"COUNTIF(Kugeln!$Y$4:$Z$52,Ergebnismenge!C54)","v":0},null,null,null,null,null,null,{"$f":"IF(AND(SUM($G$46:G60)>0,G61>0),\", \",\"\")","v":""},"",null,null,null,null,null,null,""]
[null,null,17,null,null,null,{"$f":"COUNTIF(Kugeln!$Y$4:$Z$52,Ergebnismenge!C55)","v":0},null,null,null,null,null,null,{"$f":"IF(AND(SUM($G$46:G61)>0,G62>0),\", \",\"\")","v":""},"",null,null,null,null,null,null,""]
[null,null,18,null,null,null,{"$f":"COUNTIF(Kugeln!$Y$4:$Z$52,Ergebnismenge!C56)","v":0},null,null,null,null,null,null,{"$f":"IF(AND(SUM($G$46:G62)>0,G63>0),\", \",\"\")","v":""},"",null,null,null,null,null,null,""]
[null,null,19,null,null,null,{"$f":"COUNTIF(Kugeln!$Y$4:$Z$52,Ergebnismenge!C57)","v":0},null,null,null,null,null,null,{"$f":"IF(AND(SUM($G$46:G63)>0,G64>0),\", \",\"\")","v":""},"",null,null,null,null,null,null,""]
[null,null,20,null,null,null,{"$f":"COUNTIF(Kugeln!$Y$4:$Z$52,Ergebnismenge!C58)","v":0},null,null,null,null,null,null,{"$f":"IF(AND(SUM($G$46:G64)>0,G65>0),\", \",\"\")","v":""},"",null,null,null,null,null,null,""]
[null,null,21,null,null,null,{"$f":"COUNTIF(Kugeln!$Y$4:$Z$52,Ergebnismenge!C59)","v":0},null,null,null,null,null,null,{"$f":"IF(AND(SUM($G$46:G65)>0,G66>0),\", \",\"\")","v":""},"",null,null,null,null,null,null,""]
[null,null,22,null,null,null,{"$f":"COUNTIF(Kugeln!$Y$4:$Z$52,Ergebnismenge!C60)","v":0},null,null,null,null,null,null,{"$f":"IF(AND(SUM($G$46:G66)>0,G67>0),\", \",\"\")","v":""},"",null,null,null,null,null,null,""]
[null,null,23,null,null,null,{"$f":"COUNTIF(Kugeln!$Y$4:$Z$52,Ergebnismenge!C61)","v":0},null,null,null,null,null,null,{"$f":"IF(AND(SUM($G$46:G67)>0,G68>0),\", \",\"\")","v":""},"",null,null,null,null,null,null,""]
[null,null,24,null,null,null,{"$f":"COUNTIF(Kugeln!$Y$4:$Z$52,Ergebnismenge!C62)","v":0},null,null,null,null,null,null,{"$f":"IF(AND(SUM($G$46:G68)>0,G69>0),\", \",\"\")","v":""},"",null,null,null,null,null,null,""]
[null,null,25,null,null,null,{"$f":"COUNTIF(Kugeln!$Y$4:$Z$52,Ergebnismenge!C63)","v":0},null,null,null,null,null,null,{"$f":"IF(AND(SUM($G$46:G69)>0,G70>0),\", \",\"\")","v":""},"",null,null,null,null,null,null,""]
[null,null,26,null,null,null,{"$f":"COUNTIF(Kugeln!$Y$4:$Z$52,Ergebnismenge!C64)","v":0},null,null,null,null,null,null,{"$f":"IF(AND(SUM($G$46:G70)>0,G71>0),\", \",\"\")","v":""},"",null,null,null,null,null,null,""]
[null,null,27,null,null,null,{"$f":"COUNTIF(Kugeln!$Y$4:$Z$52,Ergebnismenge!C65)","v":0},null,null,null,null,null,null,{"$f":"IF(AND(SUM($G$46:G71)>0,G72>0),\", \",\"\")","v":""},"",null,null,null,null,null,null,""]
[null,null,28,null,null,null,{"$f":"COUNTIF(Kugeln!$Y$4:$Z$52,Ergebnismenge!C66)","v":0},null,null,null,null,null,null,{"$f":"IF(AND(SUM($G$46:G72)>0,G73>0),\", \",\"\")","v":""},"",null,null,null,null,null,null,""]
[null,null,29,null,null,null,{"$f":"COUNTIF(Kugeln!$Y$4:$Z$52,Ergebnismenge!C67)","v":0},null,null,null,null,null,null,{"$f":"IF(AND(SUM($G$46:G73)>0,G74>0),\", \",\"\")","v":""},"",null,null,null,null,null,null,""]
[null,null,30,null,null,null,{"$f":"COUNTIF(Kugeln!$Y$4:$Z$52,Ergebnismenge!C68)","v":0},null,null,null,null,null,null,{"$f":"IF(AND(SUM($G$46:G74)>0,G75>0),\", \",\"\")","v":""},"",null,null,null,null,null,null,""]
[null,null,31,null,null,null,{"$f":"COUNTIF(Kugeln!$Y$4:$Z$52,Ergebnismenge!C69)","v":0},null,null,null,null,null,null,{"$f":"IF(AND(SUM($G$46:G75)>0,G76>0),\", \",\"\")","v":""},"",null,null,null,null,null,null,""]
[null,null,32,null,null,null,{"$f":"COUNTIF(Kugeln!$Y$4:$Z$52,Ergebnismenge!C70)","v":0},null,null,null,null,null,null,{"$f":"IF(AND(SUM($G$46:G76)>0,G77>0),\", \",\"\")","v":""},"",null,null,null,null,null,null,""]
[null,null,33,null,null,null,{"$f":"COUNTIF(Kugeln!$Y$4:$Z$52,Ergebnismenge!C71)","v":0},null,null,null,null,null,null,{"$f":"IF(AND(SUM($G$46:G77)>0,G78>0),\", \",\"\")","v":""},{"$f":"IF(G78>0,C78,\"\")","v":""},null,null,null,null,null,null,""]
[null,null,34,null,null,null,{"$f":"COUNTIF(Kugeln!$Y$4:$Z$52,Ergebnismenge!C72)","v":0},null,null,null,null,null,null,{"$f":"IF(AND(SUM($G$46:G78)>0,G79>0),\", \",\"\")","v":""},"",null,null,null,null,null,null,""]
[null,null,35,null,null,null,{"$f":"COUNTIF(Kugeln!$Y$4:$Z$52,Ergebnismenge!C73)","v":0},null,null,null,null,null,null,{"$f":"IF(AND(SUM($G$46:G79)>0,G80>0),\", \",\"\")","v":""},"",null,null,null,null,null,null,""]
[null,null,36,null,null,null,{"$f":"COUNTIF(Kugeln!$Y$4:$Z$52,Ergebnismenge!C74)","v":0},null,null,null,null,null,null,{"$f":"IF(AND(SUM($G$46:G80)>0,G81>0),\", \",\"\")","v":""},"",null,null,null,null,null,null,""]
[null,null,37,null,null,null,{"$f":"COUNTIF(Kugeln!$Y$4:$Z$52,Ergebnismenge!C75)","v":0},null,null,null,null,null,null,{"$f":"IF(AND(SUM($G$46:G81)>0,G82>0),\", \",\"\")","v":""},"",null,null,null,null,null,null,""]
[null,null,38,null,null,null,{"$f":"COUNTIF(Kugeln!$Y$4:$Z$52,Ergebnismenge!C76)","v":0},null,null,null,null,null,null,{"$f":"IF(AND(SUM($G$46:G82)>0,G83>0),\", \",\"\")","v":""},"",null,null,null,null,null,null,""]
[null,null,39,null,null,null,{"$f":"COUNTIF(Kugeln!$Y$4:$Z$52,Ergebnismenge!C77)","v":0},null,null,null,null,null,null,{"$f":"IF(AND(SUM($G$46:G83)>0,G84>0),\", \",\"\")","v":""},"",null,null,null,null,null,null,""]
[null,null,40,null,null,null,{"$f":"COUNTIF(Kugeln!$Y$4:$Z$52,Ergebnismenge!C78)","v":0},null,null,null,null,null,null,{"$f":"IF(AND(SUM($G$46:G84)>0,G85>0),\", \",\"\")","v":""},"",null,null,null,null,null,null,""]
[null,null,41,null,null,null,{"$f":"COUNTIF(Kugeln!$Y$4:$Z$52,Ergebnismenge!C79)","v":0},null,null,null,null,null,null,{"$f":"IF(AND(SUM($G$46:G85)>0,G86>0),\", \",\"\")","v":""},"",null,null,null,null,null,null,""]
[null,null,42,null,null,null,{"$f":"COUNTIF(Kugeln!$Y$4:$Z$52,Ergebnismenge!C80)","v":0},null,null,null,null,null,null,{"$f":"IF(AND(SUM($G$46:G86)>0,G87>0),\", \",\"\")","v":""},"",null,null,null,null,null,null,""]
[null,null,43,null,null,null,{"$f":"COUNTIF(Kugeln!$Y$4:$Z$52,Ergebnismenge!C81)","v":0},null,null,null,null,null,null,{"$f":"IF(AND(SUM($G$46:G87)>0,G88>0),\", \",\"\")","v":""},"",null,null,null,null,null,null,""]
[null,null,44,null,null,null,{"$f":"COUNTIF(Kugeln!$Y$4:$Z$52,Ergebnismenge!C82)","v":0},null,null,null,null,null,null,{"$f":"IF(AND(SUM($G$46:G88)>0,G89>0),\", \",\"\")","v":""},"",null,null,null,null,null,null,""]
[null,null,45,null,null,null,{"$f":"COUNTIF(Kugeln!$Y$4:$Z$52,Ergebnismenge!C83)","v":0},null,null,null,null,null,null,{"$f":"IF(AND(SUM($G$46:G89)>0,G90>0),\", \",\"\")","v":""},"",null,null,null,null,null,null,""]
[null,null,46,null,null,null,{"$f":"COUNTIF(Kugeln!$Y$4:$Z$52,Ergebnismenge!C84)","v":0},null,null,null,null,null,null,{"$f":"IF(AND(SUM($G$46:G90)>0,G91>0),\", \",\"\")","v":""},"",null,null,null,null,null,null,""]
[null,null,47,null,null,null,{"$f":"COUNTIF(Kugeln!$Y$4:$Z$52,Ergebnismenge!C85)","v":0},null,null,null,null,null,null,{"$f":"IF(AND(SUM($G$46:G91)>0,G92>0),\", \",\"\")","v":""},"",null,null,null,null,null,null,""]
[null,null,48,null,null,null,{"$f":"COUNTIF(Kugeln!$Y$4:$Z$52,Ergebnismenge!C86)","v":0},null,null,null,null,null,null,{"$f":"IF(AND(SUM($G$46:G92)>0,G93>0),\", \",\"\")","v":""},"",null,null,null,null,null,null,""]
[null,null,49,null,null,null,{"$f":"COUNTIF(Kugeln!$Y$4:$Z$52,Ergebnismenge!C87)","v":0},null,null,null,null,null,null,{"$f":"IF(AND(SUM($G$46:G93)>0,G94>0),\", \",\"\")","v":""},"",null,null,null,null,null,null,""]
[null,null,"|Ω| =",null,null,null,{"$f":"COUNTIF(G46:G94,\">0\")","v":8}]
[]
[null,"Anzahl (Zahl, Farbe):"]
[]
[null,null,1,null,null,"rot",{"$f":"COUNTIF(Kugeln!$X$4:$X$52,CONCATENATE(\"(\",Ergebnismenge!C92,\", \",F99,\")\"))","v":0},null,null,null,null,null,null,null,{"$f":"IF(G99>0,CONCATENATE(\"(\",F99,\", \",C99,\")\"),\"\")","v":""},null,null,null,null,null,null,""]
[null,null,2,null,null,"rot",{"$f":"COUNTIF(Kugeln!$X$4:$X$52,CONCATENATE(\"(\",Ergebnismenge!C93,\", \",F100,\")\"))","v":1},null,null,null,null,null,null,{"$f":"IF(AND(SUM($G$99:G99)>0,G100>0),\", \",\"\")","v":""},"(rot, 2)",null,null,null,null,null,null,"(rot, 2)"]
[null,null,3,null,null,"rot",{"$f":"COUNTIF(Kugeln!$X$4:$X$52,CONCATENATE(\"(\",Ergebnismenge!C94,\", \",F101,\")\"))","v":0},null,null,null,null,null,null,{"$f":"IF(AND(SUM($G$99:G100)>0,G101>0),\", \",\"\")","v":""},{"$f":"IF(G101>0,CONCATENATE(\"(\",F101,\", \",C101,\")\"),\"\")","v":""},null,null,null,null,null,null,""]
[null,null,4,null,null,"rot",{"$f":"COUNTIF(Kugeln!$X$4:$X$52,CONCATENATE(\"(\",Ergebnismenge!C95,\", \",F102,\")\"))","v":1},null,null,null,null,null,null,{"$f":"IF(AND(SUM($G$99:G101)>0,G102>0),\", \",\"\")","v":", "},{"$f":"IF(G102>0,CONCATENATE(\"(\",F102,\", \",C102,\")\"),\"\")","v":"(rot, 4)"},null,null,null,null,null,null,", (rot, 4)"]
[null,null,5,null,null,"rot",{"$f":"COUNTIF(Kugeln!$X$4:$X$52,CONCATENATE(\"(\",Ergebnismenge!C96,\", \",F103,\")\"))","v":0},null,null,null,null,null,null,{"$f":"IF(AND(SUM($G$99:G102)>0,G103>0),\", \",\"\")","v":""},"",null,null,null,null,null,null,""]
[null,null,6,null,null,"rot",{"$f":"COUNTIF(Kugeln!$X$4:$X$52,CONCATENATE(\"(\",Ergebnismenge!C97,\", \",F104,\")\"))","v":2},null,null,null,null,null,null,{"$f":"IF(AND(SUM($G$99:G103)>0,G104>0),\", \",\"\")","v":", "},"(rot, 6)",null,null,null,null,null,null,{"$f":"CONCATENATE(N104,O104)","v":", (rot, 6)"}]
[null,null,7,null,null,"rot",{"$f":"COUNTIF(Kugeln!$X$4:$X$52,CONCATENATE(\"(\",Ergebnismenge!C98,\", \",F105,\")\"))","v":1},null,null,null,null,null,null,{"$f":"IF(AND(SUM($G$99:G104)>0,G105>0),\", \",\"\")","v":", "},"(rot, 7)",null,null,null,null,null,null,", (rot, 7)"]
[null,null,8,null,null,"rot",{"$f":"COUNTIF(Kugeln!$X$4:$X$52,CONCATENATE(\"(\",Ergebnismenge!C99,\", \",F106,\")\"))","v":1},null,null,null,null,null,null,{"$f":"IF(AND(SUM($G$99:G105)>0,G106>0),\", \",\"\")","v":", "},"(rot, 8)",null,null,null,null,null,null,", (rot, 8)"]
[null,null,9,null,null,"rot",{"$f":"COUNTIF(Kugeln!$X$4:$X$52,CONCATENATE(\"(\",Ergebnismenge!C100,\", \",F107,\")\"))","v":0},null,null,null,null,null,null,{"$f":"IF(AND(SUM($G$99:G106)>0,G107>0),\", \",\"\")","v":""},"",null,null,null,null,null,null,""]
[null,null,10,null,null,"rot",{"$f":"COUNTIF(Kugeln!$X$4:$X$52,CONCATENATE(\"(\",Ergebnismenge!C101,\", \",F108,\")\"))","v":0},null,null,null,null,null,null,{"$f":"IF(AND(SUM($G$99:G107)>0,G108>0),\", \",\"\")","v":""},"",null,null,null,null,null,null,""]
[null,null,11,null,null,"rot",{"$f":"COUNTIF(Kugeln!$X$4:$X$52,CONCATENATE(\"(\",Ergebnismenge!C102,\", \",F109,\")\"))","v":0},null,null,null,null,null,null,{"$f":"IF(AND(SUM($G$99:G108)>0,G109>0),\", \",\"\")","v":""},"",null,null,null,null,null,null,""]
[null,null,12,null,null,"rot",{"$f":"COUNTIF(Kugeln!$X$4:$X$52,CONCATENATE(\"(\",Ergebnismenge!C103,\", \",F110,\")\"))","v":0},null,null,null,null,null,null,{"$f":"IF(AND(SUM($G$99:G109)>0,G110>0),\", \",\"\")","v":""},"",null,null,null,null,null,null,""]
[null,null,13,null,null,"rot",{"$f":"COUNTIF(Kugeln!$X$4:$X$52,CONCATENATE(\"(\",Ergebnismenge!C104,\", \",F111,\")\"))","v":0},null,null,null,null,null,null,{"$f":"IF(AND(SUM($G$99:G110)>0,G111>0),\", \",\"\")","v":""},"",null,null,null,null,null,null,""]
[null,null,14,null,null,"rot",{"$f":"COUNTIF(Kugeln!$X$4:$X$52,CONCATENATE(\"(\",Ergebnismenge!C105,\", \",F112,\")\"))","v":0},null,null,null,null,null,null,{"$f":"IF(AND(SUM($G$99:G111)>0,G112>0),\", \",\"\")","v":""},"",null,null,null,null,null,null,""]
[null,null,15,null,null,"rot",{"$f":"COUNTIF(Kugeln!$X$4:$X$52,CONCATENATE(\"(\",Ergebnismenge!C106,\", \",F113,\")\"))","v":0},null,null,null,null,null,null,{"$f":"IF(AND(SUM($G$99:G112)>0,G113>0),\", \",\"\")","v":""},"",null,null,null,null,null,null,""]
[null,null,16,null,null,"rot",{"$f":"COUNTIF(Kugeln!$X$4:$X$52,CONCATENATE(\"(\",Ergebnismenge!C107,\", \",F114,\")\"))","v":0},null,null,null,null,null,null,{"$f":"IF(AND(SUM($G$99:G113)>0,G114>0),\", \",\"\")","v":""},"",null,null,null,null,null,null,""]
[null,null,17,null,null,"rot",{"$f":"COUNTIF(Kugeln!$X$4:$X$52,CONCATENATE(\"(\",Ergebnismenge!C108,\", \",F115,\")\"))","v":0},null,null,null,null,null,null,{"$f":"IF(AND(SUM($G$99:G114)>0,G115>0),\", \",\"\")","v":""},"",null,null,null,null,null,null,""]
[null,null,18,null,null,"rot",{"$f":"COUNTIF(Kugeln!$X$4:$X$52,CONCATENATE(\"(\",Ergebnismenge!C109,\", \",F116,\")\"))","v":0},null,null,null,null,null,null,{"$f":"IF(AND(SUM($G$99:G115)>0,G116>0),\", \",\"\")","v":""},"",null,null,null,null,null,null,""]
[null,null,19,null,null,"rot",{"$f":"COUNTIF(Kugeln!$X$4:$X$52,CONCATENATE(\"(\",Ergebnismenge!C110,\", \",F117,\")\"))","v":0},null,null,null,null,null,null,{"$f":"IF(AND(SUM($G$99:G116)>0,G117>0),\", \",\"\")","v":""},"",null,null,null,null,null,null,""]
[null,null,20,null,null,"rot",{"$f":"COUNTIF(Kugeln!$X$4:$X$52,CONCATENATE(\"(\",Ergebnismenge!C111,\", \",F118,\")\"))","v":0},null,null,null,null,null,null,{"$f":"IF(AND(SUM($G$99:G117)>0,G118>0),\", \",\"\")","v":""},"",null,null,null,null,null,null,""]
[null,null,21,null,null,"rot",{"$f":"COUNTIF(Kugeln!$X$4:$X$52,CONCATENATE(\"(\",Ergebnismenge!C112,\", \",F119,\")\"))","v":0},null,null,null,null,null,null,{"$f":"IF(AND(SUM($G$99:G118)>0,G119>0),\", \",\"\")","v":""},"",null,null,null,null,null,null,""]
[null,null,22,null,null,"rot",{"$f":"COUNTIF(Kugeln!$X$4:$X$52,CONCATENATE(\"(\",Ergebnismenge!C113,\", \",F120,\")\"))","v":0},null,null,null,null,null,null,{"$f":"IF(AND(SUM($G$99:G119)>0,G120>0),\", \",\"\")","v":""},"",null,null,null,null,null,null,""]
[null,null,23,null,null,"rot",{"$f":"COUNTIF(Kugeln!$X$4:$X$52,CONCATENATE(\"(\",Ergebnismenge!C114,\", \",F121,\")\"))","v":0},null,null,null,null,null,null,{"$f":"IF(AND(SUM($G$99:G120)>0,G121>0),\", \",\"\")","v":""},"",null,null,null,null,null,null,""]
[null,null,24,null,null,"rot",{"$f":"COUNTIF(Kugeln!$X$4:$X$52,CONCATENATE(\"(\",Ergebnismenge!C115,\", \",F122,\")\"))","v":0},null,null,null,null,null,null,{"$f":"IF(AND(SUM($G$99:G121)>0,G122>0),\", \",\"\")","v":""},"",null,null,null,null,null,null,""]
[null,null,25,null,null,"rot",{"$f":"COUNTIF(Kugeln!$X$4:$X$52,CONCATENATE(\"(\",Ergebnismenge!C116,\", \",F123,\")\"))","v":0},null,null,null,null,null,null,{"$f":"IF(AND(SUM($G$99:G122)>0,G123>0),\", \",\"\")","v":""},"",null,null,null,null,null,null,""]
[null,null,26,null,null,"rot",{"$f":"COUNTIF(Kugeln!$X$4:$X$52,CONCATENATE(\"(\",Ergebnismenge!C117,\", \",F124,\")\"))","v":0},null,null,null,null,null,null,{"$f":"IF(AND(SUM($G$99:G123)>0,G124>0),\", \",\"\")","v":""},"",null,null,null,null,null,null,""]
[null,null,27,null,null,"rot",{"$f":"COUNTIF(Kugeln!$X$4:$X$52,CONCATENATE(\"(\",Ergebnismenge!C118,\", \",F125,\")\"))","v":0},null,null,null,null,null,null,{"$f":"IF(AND(SUM($G$99:G124)>0,G125>0),\", \",\"\")","v":""},"",null,null,null,null,null,null,""]
[null,null,28,null,null,"rot",{"$f":"COUNTIF(Kugeln!$X$4:$X$52,CONCATENATE(\"(\",Ergebnismenge!C119,\", \",F126,\")\"))","v":0},null,null,null,null,null,null,{"$f":"IF(AND(SUM($G$99:G125)>0,G126>0),\", \",\"\")","v":""},"",null,null,null,null,null,null,""]
[null,null,29,null,null,"rot",{"$f":"COUNTIF(Kugeln!$X$4:$X$52,CONCATENATE(\"(\",Ergebnismenge!C120,\", \",F127,\")\"))","v":0},null,null,null,null,null,null,{"$f":"IF(AND(SUM($G$99:G126)>0,G127>0),\", \",\"\")","v":""},"",null,null,null,null,null,null,""]
[null,null,30,null,null,"rot",{"$f":"COUNTIF(Kugeln!$X$4:$X$52,CONCATENATE(\"(\",Ergebnismenge!C121,\", \",F128,\")\"))","v":0},null,null,null,null,null,null,{"$f":"IF(AND(SUM($G$99:G127)>0,G128>0),\", \",\"\")","v":""},"",null,null,null,null,null,null,""]
[null,null,31,null,null,"rot",{"$f":"COUNTIF(Kugeln!$X$4:$X$52,CONCATENATE(\"(\",Ergebnismenge!C122,\", \",F129,\")\"))","v":0},null,null,null,null,null,null,{"$f":"IF(AND(SUM($G$99:G128)>0,G129>0),\", \",\"\")","v":""},"",null,null,null,null,null,null,""]
[null,null,32,null,null,"rot",{"$f":"COUNTIF(Kugeln!$X$4:$X$52,CONCATENATE(\"(\",Ergebnismenge!C123,\", \",F130,\")\"))","v":0},null,null,null,null,null,null,{"$f":"IF(AND(SUM($G$99:G129)>0,G130>0),\", \",\"\")","v":""},"",null,null,null,null,null,null,""]
[null,null,33,null,null,"rot",{"$f":"COUNTIF(Kugeln!$X$4:$X$52,CONCATENATE(\"(\",Ergebnismenge!C124,\", \",F131,\")\"))","v":0},null,null,null,null,null,null,{"$f":"IF(AND(SUM($G$99:G130)>0,G131>0),\", \",\"\")","v":""},"",null,null,null,null,null,null,""]
[null,null,34,null,null,"rot",{"$f":"COUNTIF(Kugeln!$X$4:$X$52,CONCATENATE(\"(\",Ergebnismenge!C125,\", \",F132,\")\"))","v":0},null,null,null,null,null,null,{"$f":"IF(AND(SUM($G$99:G131)>0,G132>0),\", \",\"\")","v":""},"",null,null,null,null,null,null,""]
[null,null,35,null,null,"rot",{"$f":"COUNTIF(Kugeln!$X$4:$X$52,CONCATENATE(\"(\",Ergebnismenge!C126,\", \",F133,\")\"))","v":0},null,null,null,null,null,null,{"$f":"IF(AND(SUM($G$99:G132)>0,G133>0),\", \",\"\")","v":""},"",null,null,null,null,null,null,""]
[null,null,36,null,null,"rot",{"$f":"COUNTIF(Kugeln!$X$4:$X$52,CONCATENATE(\"(\",Ergebnismenge!C127,\", \",F134,\")\"))","v":0},null,null,null,null,null,null,{"$f":"IF(AND(SUM($G$99:G133)>0,G134>0),\", \",\"\")","v":""},"",null,null,null,null,null,null,""]
[null,null,37,null,null,"rot",{"$f":"COUNTIF(Kugeln!$X$4:$X$52,CONCATENATE(\"(\",Ergebnismenge!C128,\", \",F135,\")\"))","v":0},null,null,null,null,null,null,{"$f":"IF(AND(SUM($G$99:G134)>0,G135>0),\", \",\"\")","v":""},"",null,null,null,null,null,null,""]
[null,null,38,null,null,"rot",{"$f":"COUNTIF(Kugeln!$X$4:$X$52,CONCATENATE(\"(\",Ergebnismenge!C129,\", \",F136,\")\"))","v":0},null,null,null,null,null,null,{"$f":"IF(AND(SUM($G$99:G135)>0,G136>0),\", \",\"\")","v":""},"",null,null,null,null,null,null,""]
[null,null,39,null,null,"rot",{"$f":"COUNTIF(Kugeln!$X$4:$X$52,CONCATENATE(\"(\",Ergebnismenge!C130,\", \",F137,\")\"))","v":0},null,null,null,null,null,null,{"$f":"IF(AND(SUM($G$99:G136)>0,G137>0),\", \",\"\")","v":""},"",null,null,null,null,null,null,""]
[null,null,40,null,null,"rot",{"$f":"COUNTIF(Kugeln!$X$4:$X$52,CONCATENATE(\"(\",Ergebnismenge!C131,\", \",F138,\")\"))","v":0},null,null,null,null,null,null,{"$f":"IF(AND(SUM($G$99:G137)>0,G138>0),\", \",\"\")","v":""},"",null,null,null,null,null,null,""]
[null,null,41,null,null,"rot",{"$f":"COUNTIF(Kugeln!$X$4:$X$52,CONCATENATE(\"(\",Ergebnismenge!C132,\", \",F139,\")\"))","v":0},null,null,null,null,null,null,{"$f":"IF(AND(SUM($G$99:G138)>0,G139>0),\", \",\"\")","v":""},"",null,null,null,null,null,null,""]
[null,null,42,null,null,"rot",{"$f":"COUNTIF(Kugeln!$X$4:$X$52,CONCATENATE(\"(\",Ergebnismenge!C133,\", \",F140,\")\"))","v":0},null,null,null,null,null,null,{"$f":"IF(AND(SUM($G$99:G139)>0,G140>0),\", \",\"\")","v":""},"",null,null,null,null,null,null,""]
[null,null,43,null,null,"rot",{"$f":"COUNTIF(Kugeln!$X$4:$X$52,CONCATENATE(\"(\",Ergebnismenge!C134,\", \",F141,\")\"))","v":0},null,null,null,null,null,null,{"$f":"IF(AND(SUM($G$99:G140)>0,G141>0),\", \",\"\")","v":""},"",null,null,null,null,null,null,""]
[null,null,44,null,null,"rot",{"$f":"COUNTIF(Kugeln!$X$4:$X$52,CONCATENATE(\"(\",Ergebnismenge!C135,\", \",F142,\")\"))","v":0},null,null,null,null,null,null,{"$f":"IF(AND(SUM($G$99:G141)>0,G142>0),\", \",\"\")","v":""},"",null,null,null,null,null,null,""]
[null,null,45,null,null,"rot",{"$f":"COUNTIF(Kugeln!$X$4:$X$52,CONCATENATE(\"(\",Ergebnismenge!C136,\", \",F143,\")\"))","v":0},null,null,null,null,null,null,{"$f":"IF(AND(SUM($G$99:G142)>0,G143>0),\", \",\"\")","v":""},"",null,null,null,null,null,null,""]
[null,null,46,null,null,"rot",{"$f":"COUNTIF(Kugeln!$X$4:$X$52,CONCATENATE(\"(\",Ergebnismenge!C137,\", \",F144,\")\"))","v":0},null,null,null,null,null,null,{"$f":"IF(AND(SUM($G$99:G143)>0,G144>0),\", \",\"\")","v":""},"",null,null,null,null,null,null,""]
[null,null,47,null,null,"rot",{"$f":"COUNTIF(Kugeln!$X$4:$X$52,CONCATENATE(\"(\",Ergebnismenge!C138,\", \",F145,\")\"))","v":0},null,null,null,null,null,null,{"$f":"IF(AND(SUM($G$99:G144)>0,G145>0),\", \",\"\")","v":""},"",null,null,null,null,null,null,""]
[null,null,48,null,null,"rot",{"$f":"COUNTIF(Kugeln!$X$4:$X$52,CONCATENATE(\"(\",Ergebnismenge!C139,\", \",F146,\")\"))","v":0},null,null,null,null,null,null,{"$f":"IF(AND(SUM($G$99:G145)>0,G146>0),\", \",\"\")","v":""},"",null,null,null,null,null,null,""]
[null,null,49,null,null,"rot",{"$f":"COUNTIF(Kugeln!$X$4:$X$52,CONCATENATE(\"(\",Ergebnismenge!C140,\", \",F147,\")\"))","v":0},null,null,null,null,null,null,{"$f":"IF(AND(SUM($G$99:G146)>0,G147>0),\", \",\"\")","v":""},"",null,null,null,null,null,null,""]
[null,null,1,null,null,"grün",{"$f":"COUNTIF(Kugeln!$X$4:$X$52,CONCATENATE(\"(\",Ergebnismenge!C141,\", \",F148,\")\"))","v":0},null,null,null,null,null,null,{"$f":"IF(AND(SUM($G$99:G147)>0,G148>0),\", \",\"\")","v":""},"",null,null,null,null,null,null,""]
[null,null,2,null,null,"grün",{"$f":"COUNTIF(Kugeln!$X$4:$X$52,CONCATENATE(\"(\",Ergebnismenge!C142,\", \",F149,\")\"))","v":2},null,null,null,null,null,null,{"$f":"IF(AND(SUM($G$99:G148)>0,G149>0),\", \",\"\")","v":", "},"(grün, 2)",null,null,null,null,null,null,", (grün, 2)"]
[null,null,3,null,null,"grün",{"$f":"COUNTIF(Kugeln!$X$4:$X$52,CONCATENATE(\"(\",Ergebnismenge!C143,\", \",F150,\")\"))","v":1},null,null,null,null,null,null,{"$f":"IF(AND(SUM($G$99:G149)>0,G150>0),\", \",\"\")","v":", "},"(grün, 3)",null,null,null,null,null,null,", (grün, 3)"]
[null,null,4,null,null,"grün",{"$f":"COUNTIF(Kugeln!$X$4:$X$52,CONCATENATE(\"(\",Ergebnismenge!C144,\", \",F151,\")\"))","v":2},null,null,null,null,null,null,{"$f":"IF(AND(SUM($G$99:G150)>0,G151>0),\", \",\"\")","v":", "},"(grün, 4)",null,null,null,null,null,null,", (grün, 4)"]
[null,null,5,null,null,"grün",{"$f":"COUNTIF(Kugeln!$X$4:$X$52,CONCATENATE(\"(\",Ergebnismenge!C145,\", \",F152,\")\"))","v":1},null,null,null,null,null,null,{"$f":"IF(AND(SUM($G$99:G151)>0,G152>0),\", \",\"\")","v":", "},"(grün, 5)",null,null,null,null,null,null,", (grün, 5)"]
[null,null,6,null,null,"grün",{"$f":"COUNTIF(Kugeln!$X$4:$X$52,CONCATENATE(\"(\",Ergebnismenge!C146,\", \",F153,\")\"))","v":2},null,null,null,null,null,null,{"$f":"IF(AND(SUM($G$99:G152)>0,G153>0),\", \",\"\")","v":", "},"(grün, 6)",null,null,null,null,null,null,", (grün, 6)"]
[null,null,7,null,null,"grün",{"$f":"COUNTIF(Kugeln!$X$4:$X$52,CONCATENATE(\"(\",Ergebnismenge!C147,\", \",F154,\")\"))","v":2},null,null,null,null,null,null,{"$f":"IF(AND(SUM($G$99:G153)>0,G154>0),\", \",\"\")","v":", "},"(grün, 7)",null,null,null,null,null,null,", (grün, 7)"]
[null,null,8,null,null,"grün",{"$f":"COUNTIF(Kugeln!$X$4:$X$52,CONCATENATE(\"(\",Ergebnismenge!C148,\", \",F155,\")\"))","v":3},null,null,null,null,null,null,{"$f":"IF(AND(SUM($G$99:G154)>0,G155>0),\", \",\"\")","v":", "},"(grün, 8)",null,null,null,null,null,null,", (grün, 8)"]
[null,null,9,null,null,"grün",{"$f":"COUNTIF(Kugeln!$X$4:$X$52,CONCATENATE(\"(\",Ergebnismenge!C149,\", \",F156,\")\"))","v":2},null,null,null,null,null,null,{"$f":"IF(AND(SUM($G$99:G155)>0,G156>0),\", \",\"\")","v":", "},"(grün, 9)",null,null,null,null,null,null,", (grün, 9)"]
[null,null,10,null,null,"grün",{"$f":"COUNTIF(Kugeln!$X$4:$X$52,CONCATENATE(\"(\",Ergebnismenge!C150,\", \",F157,\")\"))","v":0},null,null,null,null,null,null,{"$f":"IF(AND(SUM($G$99:G156)>0,G157>0),\", \",\"\")","v":""},"",null,null,null,null,null,null,""]
[null,null,11,null,null,"grün",{"$f":"COUNTIF(Kugeln!$X$4:$X$52,CONCATENATE(\"(\",Ergebnismenge!C151,\", \",F158,\")\"))","v":0},null,null,null,null,null,null,{"$f":"IF(AND(SUM($G$99:G157)>0,G158>0),\", \",\"\")","v":""},"",null,null,null,null,null,null,""]
[null,null,12,null,null,"grün",{"$f":"COUNTIF(Kugeln!$X$4:$X$52,CONCATENATE(\"(\",Ergebnismenge!C152,\", \",F159,\")\"))","v":0},null,null,null,null,null,null,{"$f":"IF(AND(SUM($G$99:G158)>0,G159>0),\", \",\"\")","v":""},"",null,null,null,null,null,null,""]
[null,null,13,null,null,"grün",{"$f":"COUNTIF(Kugeln!$X$4:$X$52,CONCATENATE(\"(\",Ergebnismenge!C153,\", \",F160,\")\"))","v":0},null,null,null,null,null,null,{"$f":"IF(AND(SUM($G$99:G159)>0,G160>0),\", \",\"\")","v":""},"",null,null,null,null,null,null,""]
[null,null,14,null,null,"grün",{"$f":"COUNTIF(Kugeln!$X$4:$X$52,CONCATENATE(\"(\",Ergebnismenge!C154,\", \",F161,\")\"))","v":0},null,null,null,null,null,null,{"$f":"IF(AND(SUM($G$99:G160)>0,G161>0),\", \",\"\")","v":""},"",null,null,null,null,null,null,""]
[null,null,15,null,null,"grün",{"$f":"COUNTIF(Kugeln!$X$4:$X$52,CONCATENATE(\"(\",Ergebnismenge!C155,\", \",F162,\")\"))","v":0},null,null,null,null,null,null,{"$f":"IF(AND(SUM($G$99:G161)>0,G162>0),\", \",\"\")","v":""},"",null,null,null,null,null,null,""]
[null,null,16,null,null,"grün",{"$f":"COUNTIF(Kugeln!$X$4:$X$52,CONCATENATE(\"(\",Ergebnismenge!C156,\", \",F163,\")\"))","v":0},null,null,null,null,null,null,{"$f":"IF(AND(SUM($G$99:G162)>0,G163>0),\", \",\"\")","v":""},"",null,null,null,null,null,null,""]
[null,null,17,null,null,"grün",{"$f":"COUNTIF(Kugeln!$X$4:$X$52,CONCATENATE(\"(\",Ergebnismenge!C157,\", \",F164,\")\"))","v":0},null,null,null,null,null,null,{"$f":"IF(AND(SUM($G$99:G163)>0,G164>0),\", \",\"\")","v":""},"",null,null,null,null,null,null,""]
[null,null,18,null,null,"grün",{"$f":"COUNTIF(Kugeln!$X$4:$X$52,CONCATENATE(\"(\",Ergebnismenge!C158,\", \",F165,\")\"))","v":0},null,null,null,null,null,null,{"$f":"IF(AND(SUM($G$99:G164)>0,G165>0),\", \",\"\")","v":""},"",null,null,null,null,null,null,""]
[null,null,19,null,null,"grün",{"$f":"COUNTIF(Kugeln!$X$4:$X$52,CONCATENATE(\"(\",Ergebnismenge!C159,\", \",F166,\")\"))","v":0},null,null,null,null,null,null,{"$f":"IF(AND(SUM($G$99:G165)>0,G166>0),\", \",\"\")","v":""},{"$f":"IF(G166>0,CONCATENATE(\"(\",F166,\", \",C166,\")\"),\"\")","v":""},null,null,null,null,null,null,""]
[null,null,20,null,null,"grün",{"$f":"COUNTIF(Kugeln!$X$4:$X$52,CONCATENATE(\"(\",Ergebnismenge!C160,\", \",F167,\")\"))","v":0},null,null,null,null,null,null,{"$f":"IF(AND(SUM($G$99:G166)>0,G167>0),\", \",\"\")","v":""},"",null,null,null,null,null,null,""]
[null,null,21,null,null,"grün",{"$f":"COUNTIF(Kugeln!$X$4:$X$52,CONCATENATE(\"(\",Ergebnismenge!C161,\", \",F168,\")\"))","v":0},null,null,null,null,null,null,{"$f":"IF(AND(SUM($G$99:G167)>0,G168>0),\", \",\"\")","v":""},"",null,null,null,null,null,null,{"$f":"CONCATENATE(N168,O168)","v":""}]
[null,null,22,null,null,"grün",{"$f":"COUNTIF(Kugeln!$X$4:$X$52,CONCATENATE(\"(\",Ergebnismenge!C162,\", \",F169,\")\"))","v":0},null,null,null,null,null,null,{"$f":"IF(AND(SUM($G$99:G168)>0,G169>0),\", \",\"\")","v":""},"",null,null,null,null,null,null,""]
[null,null,23,null,null,"grün",{"$f":"COUNTIF(Kugeln!$X$4:$X$52,CONCATENATE(\"(\",Ergebnismenge!C163,\", \",F170,\")\"))","v":0},null,null,null,null,null,null,{"$f":"IF(AND(SUM($G$99:G169)>0,G170>0),\", \",\"\")","v":""},"",null,null,null,null,null,null,""]
[null,null,24,null,null,"grün",{"$f":"COUNTIF(Kugeln!$X$4:$X$52,CONCATENATE(\"(\",Ergebnismenge!C164,\", \",F171,\")\"))","v":0},null,null,null,null,null,null,{"$f":"IF(AND(SUM($G$99:G170)>0,G171>0),\", \",\"\")","v":""},"",null,null,null,null,null,null,""]
[null,null,25,null,null,"grün",{"$f":"COUNTIF(Kugeln!$X$4:$X$52,CONCATENATE(\"(\",Ergebnismenge!C165,\", \",F172,\")\"))","v":0},null,null,null,null,null,null,{"$f":"IF(AND(SUM($G$99:G171)>0,G172>0),\", \",\"\")","v":""},"",null,null,null,null,null,null,""]
[null,null,26,null,null,"grün",{"$f":"COUNTIF(Kugeln!$X$4:$X$52,CONCATENATE(\"(\",Ergebnismenge!C166,\", \",F173,\")\"))","v":0},null,null,null,null,null,null,{"$f":"IF(AND(SUM($G$99:G172)>0,G173>0),\", \",\"\")","v":""},"",null,null,null,null,null,null,""]
[null,null,27,null,null,"grün",{"$f":"COUNTIF(Kugeln!$X$4:$X$52,CONCATENATE(\"(\",Ergebnismenge!C167,\", \",F174,\")\"))","v":0},null,null,null,null,null,null,{"$f":"IF(AND(SUM($G$99:G173)>0,G174>0),\", \",\"\")","v":""},"",null,null,null,null,null,null,""]
[null,null,28,null,null,"grün",{"$f":"COUNTIF(Kugeln!$X$4:$X$52,CONCATENATE(\"(\",Ergebnismenge!C168,\", \",F175,\")\"))","v":0},null,null,null,null,null,null,{"$f":"IF(AND(SUM($G$99:G174)>0,G175>0),\", \",\"\")","v":""},"",null,null,null,null,null,null,""]
[null,null,29,null,null,"grün",{"$f":"COUNTIF(Kugeln!$X$4:$X$52,CONCATENATE(\"(\",Ergebnismenge!C169,\", \",F176,\")\"))","v":0},null,null,null,null,null,null,{"$f":"IF(AND(SUM($G$99:G175)>0,G176>0),\", \",\"\")","v":""},"",null,null,null,null,null,null,""]
[null,null,30,null,null,"grün",{"$f":"COUNTIF(Kugeln!$X$4:$X$52,CONCATENATE(\"(\",Ergebnismenge!C170,\", \",F177,\")\"))","v":0},null,null,null,null,null,null,{"$f":"IF(AND(SUM($G$99:G176)>0,G177>0),\", \",\"\")","v":""},"",null,null,null,null,null,null,""]
[null,null,31,null,null,"grün",{"$f":"COUNTIF(Kugeln!$X$4:$X$52,CONCATENATE(\"(\",Ergebnismenge!C171,\", \",F178,\")\"))","v":0},null,null,null,null,null,null,{"$f":"IF(AND(SUM($G$99:G177)>0,G178>0),\", \",\"\")","v":""},"",null,null,null,null,null,null,""]
[null,null,32,null,null,"grün",{"$f":"COUNTIF(Kugeln!$X$4:$X$52,CONCATENATE(\"(\",Ergebnismenge!C172,\", \",F179,\")\"))","v":0},null,null,null,null,null,null,{"$f":"IF(AND(SUM($G$99:G178)>0,G179>0),\", \",\"\")","v":""},"",null,null,null,null,null,null,""]
[null,null,33,null,null,"grün",{"$f":"COUNTIF(Kugeln!$X$4:$X$52,CONCATENATE(\"(\",Ergebnismenge!C173,\", \",F180,\")\"))","v":0},null,null,null,null,null,null,{"$f":"IF(AND(SUM($G$99:G179)>0,G180>0),\", \",\"\")","v":""},"",null,null,null,null,null,null,""]
[null,null,34,null,null,"grün",{"$f":"COUNTIF(Kugeln!$X$4:$X$52,CONCATENATE(\"(\",Ergebnismenge!C174,\", \",F181,\")\"))","v":0},null,null,null,null,null,null,{"$f":"IF(AND(SUM($G$99:G180)>0,G181>0),\", \",\"\")","v":""},"",null,null,null,null,null,null,""]
[null,null,35,null,null,"grün",{"$f":"COUNTIF(Kugeln!$X$4:$X$52,CONCATENATE(\"(\",Ergebnismenge!C175,\", \",F182,\")\"))","v":0},null,null,null,null,null,null,{"$f":"IF(AND(SUM($G$99:G181)>0,G182>0),\", \",\"\")","v":""},"",null,null,null,null,null,null,""]
[null,null,36,null,null,"grün",{"$f":"COUNTIF(Kugeln!$X$4:$X$52,CONCATENATE(\"(\",Ergebnismenge!C176,\", \",F183,\")\"))","v":0},null,null,null,null,null,null,{"$f":"IF(AND(SUM($G$99:G182)>0,G183>0),\", \",\"\")","v":""},"",null,null,null,null,null,null,""]
[null,null,37,null,null,"grün",{"$f":"COUNTIF(Kugeln!$X$4:$X$52,CONCATENATE(\"(\",Ergebnismenge!C177,\", \",F184,\")\"))","v":0},null,null,null,null,null,null,{"$f":"IF(AND(SUM($G$99:G183)>0,G184>0),\", \",\"\")","v":""},"",null,null,null,null,null,null,""]
[null,null,38,null,null,"grün",{"$f":"COUNTIF(Kugeln!$X$4:$X$52,CONCATENATE(\"(\",Ergebnismenge!C178,\", \",F185,\")\"))","v":0},null,null,null,null,null,null,{"$f":"IF(AND(SUM($G$99:G184)>0,G185>0),\", \",\"\")","v":""},"",null,null,null,null,null,null,""]
[null,null,39,null,null,"grün",{"$f":"COUNTIF(Kugeln!$X$4:$X$52,CONCATENATE(\"(\",Ergebnismenge!C179,\", \",F186,\")\"))","v":0},null,null,null,null,null,null,{"$f":"IF(AND(SUM($G$99:G185)>0,G186>0),\", \",\"\")","v":""},"",null,null,null,null,null,null,""]
[null,null,40,null,null,"grün",{"$f":"COUNTIF(Kugeln!$X$4:$X$52,CONCATENATE(\"(\",Ergebnismenge!C180,\", \",F187,\")\"))","v":0},null,null,null,null,null,null,{"$f":"IF(AND(SUM($G$99:G186)>0,G187>0),\", \",\"\")","v":""},"",null,null,null,null,null,null,""]
[null,null,41,null,null,"grün",{"$f":"COUNTIF(Kugeln!$X$4:$X$52,CONCATENATE(\"(\",Ergebnismenge!C181,\", \",F188,\")\"))","v":0},null,null,null,null,null,null,{"$f":"IF(AND(SUM($G$99:G187)>0,G188>0),\", \",\"\")","v":""},"",null,null,null,null,null,null,""]
[null,null,42,null,null,"grün",{"$f":"COUNTIF(Kugeln!$X$4:$X$52,CONCATENATE(\"(\",Ergebnismenge!C182,\", \",F189,\")\"))","v":0},null,null,null,null,null,null,{"$f":"IF(AND(SUM($G$99:G188)>0,G189>0),\", \",\"\")","v":""},"",null,null,null,null,null,null,""]
[null,null,43,null,null,"grün",{"$f":"COUNTIF(Kugeln!$X$4:$X$52,CONCATENATE(\"(\",Ergebnismenge!C183,\", \",F190,\")\"))","v":0},null,null,null,null,null,null,{"$f":"IF(AND(SUM($G$99:G189)>0,G190>0),\", \",\"\")","v":""},"",null,null,null,null,null,null,""]
[null,null,44,null,null,"grün",{"$f":"COUNTIF(Kugeln!$X$4:$X$52,CONCATENATE(\"(\",Ergebnismenge!C184,\", \",F191,\")\"))","v":0},null,null,null,null,null,null,{"$f":"IF(AND(SUM($G$99:G190)>0,G191>0),\", \",\"\")","v":""},"",null,null,null,null,null,null,""]
[null,null,45,null,null,"grün",{"$f":"COUNTIF(Kugeln!$X$4:$X$52,CONCATENATE(\"(\",Ergebnismenge!C185,\", \",F192,\")\"))","v":0},null,null,null,null,null,null,{"$f":"IF(AND(SUM($G$99:G191)>0,G192>0),\", \",\"\")","v":""},"",null,null,null,null,null,null,""]
[null,null,46,null,null,"grün",{"$f":"COUNTIF(Kugeln!$X$4:$X$52,CONCATENATE(\"(\",Ergebnismenge!C186,\", \",F193,\")\"))","v":0},null,null,null,null,null,null,{"$f":"IF(AND(SUM($G$99:G192)>0,G193>0),\", \",\"\")","v":""},"",null,null,null,null,null,null,""]
[null,null,47,null,null,"grün",{"$f":"COUNTIF(Kugeln!$X$4:$X$52,CONCATENATE(\"(\",Ergebnismenge!C187,\", \",F194,\")\"))","v":0},null,null,null,null,null,null,{"$f":"IF(AND(SUM($G$99:G193)>0,G194>0),\", \",\"\")","v":""},"",null,null,null,null,null,null,""]
[null,null,48,null,null,"grün",{"$f":"COUNTIF(Kugeln!$X$4:$X$52,CONCATENATE(\"(\",Ergebnismenge!C188,\", \",F195,\")\"))","v":0},null,null,null,null,null,null,{"$f":"IF(AND(SUM($G$99:G194)>0,G195>0),\", \",\"\")","v":""},"",null,null,null,null,null,null,""]
[null,null,49,null,null,"grün",{"$f":"COUNTIF(Kugeln!$X$4:$X$52,CONCATENATE(\"(\",Ergebnismenge!C189,\", \",F196,\")\"))","v":0},null,null,null,null,null,null,{"$f":"IF(AND(SUM($G$99:G195)>0,G196>0),\", \",\"\")","v":""},"",null,null,null,null,null,null,""]
[null,null,1,null,null,"blau",{"$f":"COUNTIF(Kugeln!$X$4:$X$52,CONCATENATE(\"(\",Ergebnismenge!C190,\", \",F197,\")\"))","v":0},null,null,null,null,null,null,{"$f":"IF(AND(SUM($G$99:G196)>0,G197>0),\", \",\"\")","v":""},"",null,null,null,null,null,null,""]
[null,null,2,null,null,"blau",{"$f":"COUNTIF(Kugeln!$X$4:$X$52,CONCATENATE(\"(\",Ergebnismenge!C191,\", \",F198,\")\"))","v":1},null,null,null,null,null,null,{"$f":"IF(AND(SUM($G$99:G197)>0,G198>0),\", \",\"\")","v":", "},"(blau, 2)",null,null,null,null,null,null,", (blau, 2)"]
[null,null,3,null,null,"blau",{"$f":"COUNTIF(Kugeln!$X$4:$X$52,CONCATENATE(\"(\",Ergebnismenge!C192,\", \",F199,\")\"))","v":0},null,null,null,null,null,null,{"$f":"IF(AND(SUM($G$99:G198)>0,G199>0),\", \",\"\")","v":""},"",null,null,null,null,null,null,""]
[null,null,4,null,null,"blau",{"$f":"COUNTIF(Kugeln!$X$4:$X$52,CONCATENATE(\"(\",Ergebnismenge!C193,\", \",F200,\")\"))","v":0},null,null,null,null,null,null,{"$f":"IF(AND(SUM($G$99:G199)>0,G200>0),\", \",\"\")","v":""},"",null,null,null,null,null,null,""]
[null,null,5,null,null,"blau",{"$f":"COUNTIF(Kugeln!$X$4:$X$52,CONCATENATE(\"(\",Ergebnismenge!C194,\", \",F201,\")\"))","v":2},null,null,null,null,null,null,{"$f":"IF(AND(SUM($G$99:G200)>0,G201>0),\", \",\"\")","v":", "},"(blau, 5)",null,null,null,null,null,null,", (blau, 5)"]
[null,null,6,null,null,"blau",{"$f":"COUNTIF(Kugeln!$X$4:$X$52,CONCATENATE(\"(\",Ergebnismenge!C195,\", \",F202,\")\"))","v":0},null,null,null,null,null,null,{"$f":"IF(AND(SUM($G$99:G201)>0,G202>0),\", \",\"\")","v":""},"",null,null,null,null,null,null,""]
[null,null,7,null,null,"blau",{"$f":"COUNTIF(Kugeln!$X$4:$X$52,CONCATENATE(\"(\",Ergebnismenge!C196,\", \",F203,\")\"))","v":1},null,null,null,null,null,null,{"$f":"IF(AND(SUM($G$99:G202)>0,G203>0),\", \",\"\")","v":", "},"(blau, 7)",null,null,null,null,null,null,", (blau, 7)"]
[null,null,8,null,null,"blau",{"$f":"COUNTIF(Kugeln!$X$4:$X$52,CONCATENATE(\"(\",Ergebnismenge!C197,\", \",F204,\")\"))","v":1},null,null,null,null,null,null,{"$f":"IF(AND(SUM($G$99:G203)>0,G204>0),\", \",\"\")","v":", "},"(blau, 8)",null,null,null,null,null,null,", (blau, 8)"]
[null,null,9,null,null,"blau",{"$f":"COUNTIF(Kugeln!$X$4:$X$52,CONCATENATE(\"(\",Ergebnismenge!C198,\", \",F205,\")\"))","v":2},null,null,null,null,null,null,{"$f":"IF(AND(SUM($G$99:G204)>0,G205>0),\", \",\"\")","v":", "},"(blau, 9)",null,null,null,null,null,null,", (blau, 9)"]
[null,null,10,null,null,"blau",{"$f":"COUNTIF(Kugeln!$X$4:$X$52,CONCATENATE(\"(\",Ergebnismenge!C199,\", \",F206,\")\"))","v":0},null,null,null,null,null,null,{"$f":"IF(AND(SUM($G$99:G205)>0,G206>0),\", \",\"\")","v":""},"",null,null,null,null,null,null,""]
[null,null,11,null,null,"blau",{"$f":"COUNTIF(Kugeln!$X$4:$X$52,CONCATENATE(\"(\",Ergebnismenge!C200,\", \",F207,\")\"))","v":0},null,null,null,null,null,null,{"$f":"IF(AND(SUM($G$99:G206)>0,G207>0),\", \",\"\")","v":""},"",null,null,null,null,null,null,""]
[null,null,12,null,null,"blau",{"$f":"COUNTIF(Kugeln!$X$4:$X$52,CONCATENATE(\"(\",Ergebnismenge!C201,\", \",F208,\")\"))","v":0},null,null,null,null,null,null,{"$f":"IF(AND(SUM($G$99:G207)>0,G208>0),\", \",\"\")","v":""},"",null,null,null,null,null,null,""]
[null,null,13,null,null,"blau",{"$f":"COUNTIF(Kugeln!$X$4:$X$52,CONCATENATE(\"(\",Ergebnismenge!C202,\", \",F209,\")\"))","v":0},null,null,null,null,null,null,{"$f":"IF(AND(SUM($G$99:G208)>0,G209>0),\", \",\"\")","v":""},"",null,null,null,null,null,null,""]
[null,null,14,null,null,"blau",{"$f":"COUNTIF(Kugeln!$X$4:$X$52,CONCATENATE(\"(\",Ergebnismenge!C203,\", \",F210,\")\"))","v":0},null,null,null,null,null,null,{"$f":"IF(AND(SUM($G$99:G209)>0,G210>0),\", \",\"\")","v":""},"",null,null,null,null,null,null,""]
[null,null,15,null,null,"blau",{"$f":"COUNTIF(Kugeln!$X$4:$X$52,CONCATENATE(\"(\",Ergebnismenge!C204,\", \",F211,\")\"))","v":0},null,null,null,null,null,null,{"$f":"IF(AND(SUM($G$99:G210)>0,G211>0),\", \",\"\")","v":""},"",null,null,null,null,null,null,""]
[null,null,16,null,null,"blau",{"$f":"COUNTIF(Kugeln!$X$4:$X$52,CONCATENATE(\"(\",Ergebnismenge!C205,\", \",F212,\")\"))","v":0},null,null,null,null,null,null,{"$f":"IF(AND(SUM($G$99:G211)>0,G212>0),\", \",\"\")","v":""},"",null,null,null,null,null,null,""]
[null,null,17,null,null,"blau",{"$f":"COUNTIF(Kugeln!$X$4:$X$52,CONCATENATE(\"(\",Ergebnismenge!C206,\", \",F213,\")\"))","v":0},null,null,null,null,null,null,{"$f":"IF(AND(SUM($G$99:G212)>0,G213>0),\", \",\"\")","v":""},"",null,null,null,null,null,null,""]
[null,null,18,null,null,"blau",{"$f":"COUNTIF(Kugeln!$X$4:$X$52,CONCATENATE(\"(\",Ergebnismenge!C207,\", \",F214,\")\"))","v":0},null,null,null,null,null,null,{"$f":"IF(AND(SUM($G$99:G213)>0,G214>0),\", \",\"\")","v":""},"",null,null,null,null,null,null,""]
[null,null,19,null,null,"blau",{"$f":"COUNTIF(Kugeln!$X$4:$X$52,CONCATENATE(\"(\",Ergebnismenge!C208,\", \",F215,\")\"))","v":0},null,null,null,null,null,null,{"$f":"IF(AND(SUM($G$99:G214)>0,G215>0),\", \",\"\")","v":""},"",null,null,null,null,null,null,""]
[null,null,20,null,null,"blau",{"$f":"COUNTIF(Kugeln!$X$4:$X$52,CONCATENATE(\"(\",Ergebnismenge!C209,\", \",F216,\")\"))","v":0},null,null,null,null,null,null,{"$f":"IF(AND(SUM($G$99:G215)>0,G216>0),\", \",\"\")","v":""},"",null,null,null,null,null,null,""]
[null,null,21,null,null,"blau",{"$f":"COUNTIF(Kugeln!$X$4:$X$52,CONCATENATE(\"(\",Ergebnismenge!C210,\", \",F217,\")\"))","v":0},null,null,null,null,null,null,{"$f":"IF(AND(SUM($G$99:G216)>0,G217>0),\", \",\"\")","v":""},"",null,null,null,null,null,null,""]
[null,null,22,null,null,"blau",{"$f":"COUNTIF(Kugeln!$X$4:$X$52,CONCATENATE(\"(\",Ergebnismenge!C211,\", \",F218,\")\"))","v":0},null,null,null,null,null,null,{"$f":"IF(AND(SUM($G$99:G217)>0,G218>0),\", \",\"\")","v":""},"",null,null,null,null,null,null,""]
[null,null,23,null,null,"blau",{"$f":"COUNTIF(Kugeln!$X$4:$X$52,CONCATENATE(\"(\",Ergebnismenge!C212,\", \",F219,\")\"))","v":0},null,null,null,null,null,null,{"$f":"IF(AND(SUM($G$99:G218)>0,G219>0),\", \",\"\")","v":""},"",null,null,null,null,null,null,""]
[null,null,24,null,null,"blau",{"$f":"COUNTIF(Kugeln!$X$4:$X$52,CONCATENATE(\"(\",Ergebnismenge!C213,\", \",F220,\")\"))","v":0},null,null,null,null,null,null,{"$f":"IF(AND(SUM($G$99:G219)>0,G220>0),\", \",\"\")","v":""},"",null,null,null,null,null,null,""]
[null,null,25,null,null,"blau",{"$f":"COUNTIF(Kugeln!$X$4:$X$52,CONCATENATE(\"(\",Ergebnismenge!C214,\", \",F221,\")\"))","v":0},null,null,null,null,null,null,{"$f":"IF(AND(SUM($G$99:G220)>0,G221>0),\", \",\"\")","v":""},"",null,null,null,null,null,null,""]
[null,null,26,null,null,"blau",{"$f":"COUNTIF(Kugeln!$X$4:$X$52,CONCATENATE(\"(\",Ergebnismenge!C215,\", \",F222,\")\"))","v":0},null,null,null,null,null,null,{"$f":"IF(AND(SUM($G$99:G221)>0,G222>0),\", \",\"\")","v":""},"",null,null,null,null,null,null,""]
[null,null,27,null,null,"blau",{"$f":"COUNTIF(Kugeln!$X$4:$X$52,CONCATENATE(\"(\",Ergebnismenge!C216,\", \",F223,\")\"))","v":0},null,null,null,null,null,null,{"$f":"IF(AND(SUM($G$99:G222)>0,G223>0),\", \",\"\")","v":""},"",null,null,null,null,null,null,""]
[null,null,28,null,null,"blau",{"$f":"COUNTIF(Kugeln!$X$4:$X$52,CONCATENATE(\"(\",Ergebnismenge!C217,\", \",F224,\")\"))","v":0},null,null,null,null,null,null,{"$f":"IF(AND(SUM($G$99:G223)>0,G224>0),\", \",\"\")","v":""},"",null,null,null,null,null,null,""]
[null,null,29,null,null,"blau",{"$f":"COUNTIF(Kugeln!$X$4:$X$52,CONCATENATE(\"(\",Ergebnismenge!C218,\", \",F225,\")\"))","v":0},null,null,null,null,null,null,{"$f":"IF(AND(SUM($G$99:G224)>0,G225>0),\", \",\"\")","v":""},"",null,null,null,null,null,null,""]
[null,null,30,null,null,"blau",{"$f":"COUNTIF(Kugeln!$X$4:$X$52,CONCATENATE(\"(\",Ergebnismenge!C219,\", \",F226,\")\"))","v":0},null,null,null,null,null,null,{"$f":"IF(AND(SUM($G$99:G225)>0,G226>0),\", \",\"\")","v":""},"",null,null,null,null,null,null,""]
[null,null,31,null,null,"blau",{"$f":"COUNTIF(Kugeln!$X$4:$X$52,CONCATENATE(\"(\",Ergebnismenge!C220,\", \",F227,\")\"))","v":0},null,null,null,null,null,null,{"$f":"IF(AND(SUM($G$99:G226)>0,G227>0),\", \",\"\")","v":""},"",null,null,null,null,null,null,""]
[null,null,32,null,null,"blau",{"$f":"COUNTIF(Kugeln!$X$4:$X$52,CONCATENATE(\"(\",Ergebnismenge!C221,\", \",F228,\")\"))","v":0},null,null,null,null,null,null,{"$f":"IF(AND(SUM($G$99:G227)>0,G228>0),\", \",\"\")","v":""},"",null,null,null,null,null,null,""]
[null,null,33,null,null,"blau",{"$f":"COUNTIF(Kugeln!$X$4:$X$52,CONCATENATE(\"(\",Ergebnismenge!C222,\", \",F229,\")\"))","v":0},null,null,null,null,null,null,{"$f":"IF(AND(SUM($G$99:G228)>0,G229>0),\", \",\"\")","v":""},"",null,null,null,null,null,null,""]
[null,null,34,null,null,"blau",{"$f":"COUNTIF(Kugeln!$X$4:$X$52,CONCATENATE(\"(\",Ergebnismenge!C223,\", \",F230,\")\"))","v":0},null,null,null,null,null,null,{"$f":"IF(AND(SUM($G$99:G229)>0,G230>0),\", \",\"\")","v":""},{"$f":"IF(G230>0,CONCATENATE(\"(\",F230,\", \",C230,\")\"),\"\")","v":""},null,null,null,null,null,null,""]
[null,null,35,null,null,"blau",{"$f":"COUNTIF(Kugeln!$X$4:$X$52,CONCATENATE(\"(\",Ergebnismenge!C224,\", \",F231,\")\"))","v":0},null,null,null,null,null,null,{"$f":"IF(AND(SUM($G$99:G230)>0,G231>0),\", \",\"\")","v":""},"",null,null,null,null,null,null,""]
[null,null,36,null,null,"blau",{"$f":"COUNTIF(Kugeln!$X$4:$X$52,CONCATENATE(\"(\",Ergebnismenge!C225,\", \",F232,\")\"))","v":0},null,null,null,null,null,null,{"$f":"IF(AND(SUM($G$99:G231)>0,G232>0),\", \",\"\")","v":""},"",null,null,null,null,null,null,{"$f":"CONCATENATE(N232,O232)","v":""}]
[null,null,37,null,null,"blau",{"$f":"COUNTIF(Kugeln!$X$4:$X$52,CONCATENATE(\"(\",Ergebnismenge!C226,\", \",F233,\")\"))","v":0},null,null,null,null,null,null,{"$f":"IF(AND(SUM($G$99:G232)>0,G233>0),\", \",\"\")","v":""},"",null,null,null,null,null,null,""]
[null,null,38,null,null,"blau",{"$f":"COUNTIF(Kugeln!$X$4:$X$52,CONCATENATE(\"(\",Ergebnismenge!C227,\", \",F234,\")\"))","v":0},null,null,null,null,null,null,{"$f":"IF(AND(SUM($G$99:G233)>0,G234>0),\", \",\"\")","v":""},"",null,null,null,null,null,null,""]
[null,null,39,null,null,"blau",{"$f":"COUNTIF(Kugeln!$X$4:$X$52,CONCATENATE(\"(\",Ergebnismenge!C228,\", \",F235,\")\"))","v":0},null,null,null,null,null,null,{"$f":"IF(AND(SUM($G$99:G234)>0,G235>0),\", \",\"\")","v":""},"",null,null,null,null,null,null,""]
[null,null,40,null,null,"blau",{"$f":"COUNTIF(Kugeln!$X$4:$X$52,CONCATENATE(\"(\",Ergebnismenge!C229,\", \",F236,\")\"))","v":0},null,null,null,null,null,null,{"$f":"IF(AND(SUM($G$99:G235)>0,G236>0),\", \",\"\")","v":""},"",null,null,null,null,null,null,""]
[null,null,41,null,null,"blau",{"$f":"COUNTIF(Kugeln!$X$4:$X$52,CONCATENATE(\"(\",Ergebnismenge!C230,\", \",F237,\")\"))","v":0},null,null,null,null,null,null,{"$f":"IF(AND(SUM($G$99:G236)>0,G237>0),\", \",\"\")","v":""},"",null,null,null,null,null,null,""]
[null,null,42,null,null,"blau",{"$f":"COUNTIF(Kugeln!$X$4:$X$52,CONCATENATE(\"(\",Ergebnismenge!C231,\", \",F238,\")\"))","v":0},null,null,null,null,null,null,{"$f":"IF(AND(SUM($G$99:G237)>0,G238>0),\", \",\"\")","v":""},"",null,null,null,null,null,null,""]
[null,null,43,null,null,"blau",{"$f":"COUNTIF(Kugeln!$X$4:$X$52,CONCATENATE(\"(\",Ergebnismenge!C232,\", \",F239,\")\"))","v":0},null,null,null,null,null,null,{"$f":"IF(AND(SUM($G$99:G238)>0,G239>0),\", \",\"\")","v":""},"",null,null,null,null,null,null,""]
[null,null,44,null,null,"blau",{"$f":"COUNTIF(Kugeln!$X$4:$X$52,CONCATENATE(\"(\",Ergebnismenge!C233,\", \",F240,\")\"))","v":0},null,null,null,null,null,null,{"$f":"IF(AND(SUM($G$99:G239)>0,G240>0),\", \",\"\")","v":""},"",null,null,null,null,null,null,""]
[null,null,45,null,null,"blau",{"$f":"COUNTIF(Kugeln!$X$4:$X$52,CONCATENATE(\"(\",Ergebnismenge!C234,\", \",F241,\")\"))","v":0},null,null,null,null,null,null,{"$f":"IF(AND(SUM($G$99:G240)>0,G241>0),\", \",\"\")","v":""},"",null,null,null,null,null,null,""]
[null,null,46,null,null,"blau",{"$f":"COUNTIF(Kugeln!$X$4:$X$52,CONCATENATE(\"(\",Ergebnismenge!C235,\", \",F242,\")\"))","v":0},null,null,null,null,null,null,{"$f":"IF(AND(SUM($G$99:G241)>0,G242>0),\", \",\"\")","v":""},"",null,null,null,null,null,null,""]
[null,null,47,null,null,"blau",{"$f":"COUNTIF(Kugeln!$X$4:$X$52,CONCATENATE(\"(\",Ergebnismenge!C236,\", \",F243,\")\"))","v":0},null,null,null,null,null,null,{"$f":"IF(AND(SUM($G$99:G242)>0,G243>0),\", \",\"\")","v":""},"",null,null,null,null,null,null,""]
[null,null,48,null,null,"blau",{"$f":"COUNTIF(Kugeln!$X$4:$X$52,CONCATENATE(\"(\",Ergebnismenge!C237,\", \",F244,\")\"))","v":0},null,null,null,null,null,null,{"$f":"IF(AND(SUM($G$99:G243)>0,G244>0),\", \",\"\")","v":""},"",null,null,null,null,null,null,""]
[null,null,49,null,null,"blau",{"$f":"COUNTIF(Kugeln!$X$4:$X$52,CONCATENATE(\"(\",Ergebnismenge!C238,\", \",F245,\")\"))","v":0},null,null,null,null,null,null,{"$f":"IF(AND(SUM($G$99:G244)>0,G245>0),\", \",\"\")","v":""},"",null,null,null,null,null,null,""]
[null,null,1,null,null,"gelb",{"$f":"COUNTIF(Kugeln!$X$4:$X$52,CONCATENATE(\"(\",Ergebnismenge!C239,\", \",F246,\")\"))","v":0},null,null,null,null,null,null,{"$f":"IF(AND(SUM($G$99:G245)>0,G246>0),\", \",\"\")","v":""},"",null,null,null,null,null,null,""]
[null,null,2,null,null,"gelb",{"$f":"COUNTIF(Kugeln!$X$4:$X$52,CONCATENATE(\"(\",Ergebnismenge!C240,\", \",F247,\")\"))","v":0},null,null,null,null,null,null,{"$f":"IF(AND(SUM($G$99:G246)>0,G247>0),\", \",\"\")","v":""},"",null,null,null,null,null,null,""]
[null,null,3,null,null,"gelb",{"$f":"COUNTIF(Kugeln!$X$4:$X$52,CONCATENATE(\"(\",Ergebnismenge!C241,\", \",F248,\")\"))","v":1},null,null,null,null,null,null,{"$f":"IF(AND(SUM($G$99:G247)>0,G248>0),\", \",\"\")","v":", "},"(gelb, 3)",null,null,null,null,null,null,", (gelb, 3)"]
[null,null,4,null,null,"gelb",{"$f":"COUNTIF(Kugeln!$X$4:$X$52,CONCATENATE(\"(\",Ergebnismenge!C242,\", \",F249,\")\"))","v":1},null,null,null,null,null,null,{"$f":"IF(AND(SUM($G$99:G248)>0,G249>0),\", \",\"\")","v":", "},"(gelb, 4)",null,null,null,null,null,null,", (gelb, 4)"]
[null,null,5,null,null,"gelb",{"$f":"COUNTIF(Kugeln!$X$4:$X$52,CONCATENATE(\"(\",Ergebnismenge!C243,\", \",F250,\")\"))","v":2},null,null,null,null,null,null,{"$f":"IF(AND(SUM($G$99:G249)>0,G250>0),\", \",\"\")","v":", "},"(gelb, 5)",null,null,null,null,null,null,", (gelb, 5)"]
[null,null,6,null,null,"gelb",{"$f":"COUNTIF(Kugeln!$X$4:$X$52,CONCATENATE(\"(\",Ergebnismenge!C244,\", \",F251,\")\"))","v":2},null,null,null,null,null,null,{"$f":"IF(AND(SUM($G$99:G250)>0,G251>0),\", \",\"\")","v":", "},"(gelb, 6)",null,null,null,null,null,null,", (gelb, 6)"]
[null,null,7,null,null,"gelb",{"$f":"COUNTIF(Kugeln!$X$4:$X$52,CONCATENATE(\"(\",Ergebnismenge!C245,\", \",F252,\")\"))","v":1},null,null,null,null,null,null,{"$f":"IF(AND(SUM($G$99:G251)>0,G252>0),\", \",\"\")","v":", "},"(gelb, 7)",null,null,null,null,null,null,", (gelb, 7)"]
[null,null,8,null,null,"gelb",{"$f":"COUNTIF(Kugeln!$X$4:$X$52,CONCATENATE(\"(\",Ergebnismenge!C246,\", \",F253,\")\"))","v":0},null,null,null,null,null,null,{"$f":"IF(AND(SUM($G$99:G252)>0,G253>0),\", \",\"\")","v":""},"",null,null,null,null,null,null,""]
[null,null,9,null,null,"gelb",{"$f":"COUNTIF(Kugeln!$X$4:$X$52,CONCATENATE(\"(\",Ergebnismenge!C247,\", \",F254,\")\"))","v":2},null,null,null,null,null,null,{"$f":"IF(AND(SUM($G$99:G253)>0,G254>0),\", \",\"\")","v":", "},"(gelb, 9)",null,null,null,null,null,null,", (gelb, 9)"]
[null,null,10,null,null,"gelb",{"$f":"COUNTIF(Kugeln!$X$4:$X$52,CONCATENATE(\"(\",Ergebnismenge!C248,\", \",F255,\")\"))","v":0},null,null,null,null,null,null,{"$f":"IF(AND(SUM($G$99:G254)>0,G255>0),\", \",\"\")","v":""},"",null,null,null,null,null,null,""]
[null,null,11,null,null,"gelb",{"$f":"COUNTIF(Kugeln!$X$4:$X$52,CONCATENATE(\"(\",Ergebnismenge!C249,\", \",F256,\")\"))","v":0},null,null,null,null,null,null,{"$f":"IF(AND(SUM($G$99:G255)>0,G256>0),\", \",\"\")","v":""},"",null,null,null,null,null,null,""]
[null,null,12,null,null,"gelb",{"$f":"COUNTIF(Kugeln!$X$4:$X$52,CONCATENATE(\"(\",Ergebnismenge!C250,\", \",F257,\")\"))","v":0},null,null,null,null,null,null,{"$f":"IF(AND(SUM($G$99:G256)>0,G257>0),\", \",\"\")","v":""},"",null,null,null,null,null,null,""]
[null,null,13,null,null,"gelb",{"$f":"COUNTIF(Kugeln!$X$4:$X$52,CONCATENATE(\"(\",Ergebnismenge!C251,\", \",F258,\")\"))","v":0},null,null,null,null,null,null,{"$f":"IF(AND(SUM($G$99:G257)>0,G258>0),\", \",\"\")","v":""},"",null,null,null,null,null,null,""]
[null,null,14,null,null,"gelb",{"$f":"COUNTIF(Kugeln!$X$4:$X$52,CONCATENATE(\"(\",Ergebnismenge!C252,\", \",F259,\")\"))","v":0},null,null,null,null,null,null,{"$f":"IF(AND(SUM($G$99:G258)>0,G259>0),\", \",\"\")","v":""},"",null,null,null,null,null,null,""]
[null,null,15,null,null,"gelb",{"$f":"COUNTIF(Kugeln!$X$4:$X$52,CONCATENATE(\"(\",Ergebnismenge!C253,\", \",F260,\")\"))","v":0},null,null,null,null,null,null,{"$f":"IF(AND(SUM($G$99:G259)>0,G260>0),\", \",\"\")","v":""},"",null,null,null,null,null,null,""]
[null,null,16,null,null,"gelb",{"$f":"COUNTIF(Kugeln!$X$4:$X$52,CONCATENATE(\"(\",Ergebnismenge!C254,\", \",F261,\")\"))","v":0},null,null,null,null,null,null,{"$f":"IF(AND(SUM($G$99:G260)>0,G261>0),\", \",\"\")","v":""},"",null,null,null,null,null,null,""]
[null,null,17,null,null,"gelb",{"$f":"COUNTIF(Kugeln!$X$4:$X$52,CONCATENATE(\"(\",Ergebnismenge!C255,\", \",F262,\")\"))","v":0},null,null,null,null,null,null,{"$f":"IF(AND(SUM($G$99:G261)>0,G262>0),\", \",\"\")","v":""},"",null,null,null,null,null,null,""]
[null,null,18,null,null,"gelb",{"$f":"COUNTIF(Kugeln!$X$4:$X$52,CONCATENATE(\"(\",Ergebnismenge!C256,\", \",F263,\")\"))","v":0},null,null,null,null,null,null,{"$f":"IF(AND(SUM($G$99:G262)>0,G263>0),\", \",\"\")","v":""},"",null,null,null,null,null,null,""]
[null,null,19,null,null,"gelb",{"$f":"COUNTIF(Kugeln!$X$4:$X$52,CONCATENATE(\"(\",Ergebnismenge!C257,\", \",F264,\")\"))","v":0},null,null,null,null,null,null,{"$f":"IF(AND(SUM($G$99:G263)>0,G264>0),\", \",\"\")","v":""},"",null,null,null,null,null,null,""]
[null,null,20,null,null,"gelb",{"$f":"COUNTIF(Kugeln!$X$4:$X$52,CONCATENATE(\"(\",Ergebnismenge!C258,\", \",F265,\")\"))","v":0},null,null,null,null,null,null,{"$f":"IF(AND(SUM($G$99:G264)>0,G265>0),\", \",\"\")","v":""},"",null,null,null,null,null,null,""]
[null,null,21,null,null,"gelb",{"$f":"COUNTIF(Kugeln!$X$4:$X$52,CONCATENATE(\"(\",Ergebnismenge!C259,\", \",F266,\")\"))","v":0},null,null,null,null,null,null,{"$f":"IF(AND(SUM($G$99:G265)>0,G266>0),\", \",\"\")","v":""},"",null,null,null,null,null,null,""]
[null,null,22,null,null,"gelb",{"$f":"COUNTIF(Kugeln!$X$4:$X$52,CONCATENATE(\"(\",Ergebnismenge!C260,\", \",F267,\")\"))","v":0},null,null,null,null,null,null,{"$f":"IF(AND(SUM($G$99:G266)>0,G267>0),\", \",\"\")","v":""},"",null,null,null,null,null,null,""]
[null,null,23,null,null,"gelb",{"$f":"COUNTIF(Kugeln!$X$4:$X$52,CONCATENATE(\"(\",Ergebnismenge!C261,\", \",F268,\")\"))","v":0},null,null,null,null,null,null,{"$f":"IF(AND(SUM($G$99:G267)>0,G268>0),\", \",\"\")","v":""},"",null,null,null,null,null,null,""]
[null,null,24,null,null,"gelb",{"$f":"COUNTIF(Kugeln!$X$4:$X$52,CONCATENATE(\"(\",Ergebnismenge!C262,\", \",F269,\")\"))","v":0},null,null,null,null,null,null,{"$f":"IF(AND(SUM($G$99:G268)>0,G269>0),\", \",\"\")","v":""},"",null,null,null,null,null,null,""]
[null,null,25,null,null,"gelb",{"$f":"COUNTIF(Kugeln!$X$4:$X$52,CONCATENATE(\"(\",Ergebnismenge!C263,\", \",F270,\")\"))","v":0},null,null,null,null,null,null,{"$f":"IF(AND(SUM($G$99:G269)>0,G270>0),\", \",\"\")","v":""},"",null,null,null,null,null,null,""]
[null,null,26,null,null,"gelb",{"$f":"COUNTIF(Kugeln!$X$4:$X$52,CONCATENATE(\"(\",Ergebnismenge!C264,\", \",F271,\")\"))","v":0},null,null,null,null,null,null,{"$f":"IF(AND(SUM($G$99:G270)>0,G271>0),\", \",\"\")","v":""},"",null,null,null,null,null,null,""]
[null,null,27,null,null,"gelb",{"$f":"COUNTIF(Kugeln!$X$4:$X$52,CONCATENATE(\"(\",Ergebnismenge!C265,\", \",F272,\")\"))","v":0},null,null,null,null,null,null,{"$f":"IF(AND(SUM($G$99:G271)>0,G272>0),\", \",\"\")","v":""},"",null,null,null,null,null,null,""]
[null,null,28,null,null,"gelb",{"$f":"COUNTIF(Kugeln!$X$4:$X$52,CONCATENATE(\"(\",Ergebnismenge!C266,\", \",F273,\")\"))","v":0},null,null,null,null,null,null,{"$f":"IF(AND(SUM($G$99:G272)>0,G273>0),\", \",\"\")","v":""},"",null,null,null,null,null,null,""]
[null,null,29,null,null,"gelb",{"$f":"COUNTIF(Kugeln!$X$4:$X$52,CONCATENATE(\"(\",Ergebnismenge!C267,\", \",F274,\")\"))","v":0},null,null,null,null,null,null,{"$f":"IF(AND(SUM($G$99:G273)>0,G274>0),\", \",\"\")","v":""},"",null,null,null,null,null,null,""]
[null,null,30,null,null,"gelb",{"$f":"COUNTIF(Kugeln!$X$4:$X$52,CONCATENATE(\"(\",Ergebnismenge!C268,\", \",F275,\")\"))","v":0},null,null,null,null,null,null,{"$f":"IF(AND(SUM($G$99:G274)>0,G275>0),\", \",\"\")","v":""},"",null,null,null,null,null,null,""]
[null,null,31,null,null,"gelb",{"$f":"COUNTIF(Kugeln!$X$4:$X$52,CONCATENATE(\"(\",Ergebnismenge!C269,\", \",F276,\")\"))","v":0},null,null,null,null,null,null,{"$f":"IF(AND(SUM($G$99:G275)>0,G276>0),\", \",\"\")","v":""},"",null,null,null,null,null,null,""]
[null,null,32,null,null,"gelb",{"$f":"COUNTIF(Kugeln!$X$4:$X$52,CONCATENATE(\"(\",Ergebnismenge!C270,\", \",F277,\")\"))","v":0},null,null,null,null,null,null,{"$f":"IF(AND(SUM($G$99:G276)>0,G277>0),\", \",\"\")","v":""},"",null,null,null,null,null,null,""]
[null,null,33,null,null,"gelb",{"$f":"COUNTIF(Kugeln!$X$4:$X$52,CONCATENATE(\"(\",Ergebnismenge!C271,\", \",F278,\")\"))","v":0},null,null,null,null,null,null,{"$f":"IF(AND(SUM($G$99:G277)>0,G278>0),\", \",\"\")","v":""},"",null,null,null,null,null,null,""]
[null,null,34,null,null,"gelb",{"$f":"COUNTIF(Kugeln!$X$4:$X$52,CONCATENATE(\"(\",Ergebnismenge!C272,\", \",F279,\")\"))","v":0},null,null,null,null,null,null,{"$f":"IF(AND(SUM($G$99:G278)>0,G279>0),\", \",\"\")","v":""},"",null,null,null,null,null,null,""]
[null,null,35,null,null,"gelb",{"$f":"COUNTIF(Kugeln!$X$4:$X$52,CONCATENATE(\"(\",Ergebnismenge!C273,\", \",F280,\")\"))","v":0},null,null,null,null,null,null,{"$f":"IF(AND(SUM($G$99:G279)>0,G280>0),\", \",\"\")","v":""},"",null,null,null,null,null,null,""]
[null,null,36,null,null,"gelb",{"$f":"COUNTIF(Kugeln!$X$4:$X$52,CONCATENATE(\"(\",Ergebnismenge!C274,\", \",F281,\")\"))","v":0},null,null,null,null,null,null,{"$f":"IF(AND(SUM($G$99:G280)>0,G281>0),\", \",\"\")","v":""},"",null,null,null,null,null,null,""]
[null,null,37,null,null,"gelb",{"$f":"COUNTIF(Kugeln!$X$4:$X$52,CONCATENATE(\"(\",Ergebnismenge!C275,\", \",F282,\")\"))","v":0},null,null,null,null,null,null,{"$f":"IF(AND(SUM($G$99:G281)>0,G282>0),\", \",\"\")","v":""},"",null,null,null,null,null,null,""]
[null,null,38,null,null,"gelb",{"$f":"COUNTIF(Kugeln!$X$4:$X$52,CONCATENATE(\"(\",Ergebnismenge!C276,\", \",F283,\")\"))","v":0},null,null,null,null,null,null,{"$f":"IF(AND(SUM($G$99:G282)>0,G283>0),\", \",\"\")","v":""},"",null,null,null,null,null,null,""]
[null,null,39,null,null,"gelb",{"$f":"COUNTIF(Kugeln!$X$4:$X$52,CONCATENATE(\"(\",Ergebnismenge!C277,\", \",F284,\")\"))","v":0},null,null,null,null,null,null,{"$f":"IF(AND(SUM($G$99:G283)>0,G284>0),\", \",\"\")","v":""},"",null,null,null,null,null,null,""]
[null,null,40,null,null,"gelb",{"$f":"COUNTIF(Kugeln!$X$4:$X$52,CONCATENATE(\"(\",Ergebnismenge!C278,\", \",F285,\")\"))","v":0},null,null,null,null,null,null,{"$f":"IF(AND(SUM($G$99:G284)>0,G285>0),\", \",\"\")","v":""},"",null,null,null,null,null,null,""]
[null,null,41,null,null,"gelb",{"$f":"COUNTIF(Kugeln!$X$4:$X$52,CONCATENATE(\"(\",Ergebnismenge!C279,\", \",F286,\")\"))","v":0},null,null,null,null,null,null,{"$f":"IF(AND(SUM($G$99:G285)>0,G286>0),\", \",\"\")","v":""},"",null,null,null,null,null,null,""]
[null,null,42,null,null,"gelb",{"$f":"COUNTIF(Kugeln!$X$4:$X$52,CONCATENATE(\"(\",Ergebnismenge!C280,\", \",F287,\")\"))","v":0},null,null,null,null,null,null,{"$f":"IF(AND(SUM($G$99:G286)>0,G287>0),\", \",\"\")","v":""},"",null,null,null,null,null,null,""]
[null,null,43,null,null,"gelb",{"$f":"COUNTIF(Kugeln!$X$4:$X$52,CONCATENATE(\"(\",Ergebnismenge!C281,\", \",F288,\")\"))","v":0},null,null,null,null,null,null,{"$f":"IF(AND(SUM($G$99:G287)>0,G288>0),\", \",\"\")","v":""},"",null,null,null,null,null,null,""]
[null,null,44,null,null,"gelb",{"$f":"COUNTIF(Kugeln!$X$4:$X$52,CONCATENATE(\"(\",Ergebnismenge!C282,\", \",F289,\")\"))","v":0},null,null,null,null,null,null,{"$f":"IF(AND(SUM($G$99:G288)>0,G289>0),\", \",\"\")","v":""},"",null,null,null,null,null,null,""]
[null,null,45,null,null,"gelb",{"$f":"COUNTIF(Kugeln!$X$4:$X$52,CONCATENATE(\"(\",Ergebnismenge!C283,\", \",F290,\")\"))","v":0},null,null,null,null,null,null,{"$f":"IF(AND(SUM($G$99:G289)>0,G290>0),\", \",\"\")","v":""},"",null,null,null,null,null,null,""]
[null,null,46,null,null,"gelb",{"$f":"COUNTIF(Kugeln!$X$4:$X$52,CONCATENATE(\"(\",Ergebnismenge!C284,\", \",F291,\")\"))","v":0},null,null,null,null,null,null,{"$f":"IF(AND(SUM($G$99:G290)>0,G291>0),\", \",\"\")","v":""},"",null,null,null,null,null,null,""]
[null,null,47,null,null,"gelb",{"$f":"COUNTIF(Kugeln!$X$4:$X$52,CONCATENATE(\"(\",Ergebnismenge!C285,\", \",F292,\")\"))","v":0},null,null,null,null,null,null,{"$f":"IF(AND(SUM($G$99:G291)>0,G292>0),\", \",\"\")","v":""},"",null,null,null,null,null,null,""]
[null,null,48,null,null,"gelb",{"$f":"COUNTIF(Kugeln!$X$4:$X$52,CONCATENATE(\"(\",Ergebnismenge!C286,\", \",F293,\")\"))","v":0},null,null,null,null,null,null,{"$f":"IF(AND(SUM($G$99:G292)>0,G293>0),\", \",\"\")","v":""},"",null,null,null,null,null,null,""]
[null,null,49,null,null,"gelb",{"$f":"COUNTIF(Kugeln!$X$4:$X$52,CONCATENATE(\"(\",Ergebnismenge!C287,\", \",F294,\")\"))","v":0},null,null,null,null,null,null,{"$f":"IF(AND(SUM($G$99:G293)>0,G294>0),\", \",\"\")","v":""},{"$f":"IF(G294>0,CONCATENATE(\"(\",F294,\", \",C294,\")\"),\"\")","v":""},null,null,null,null,null,null,""]
[null,null,1,null,null,"grau",{"$f":"COUNTIF(Kugeln!$X$4:$X$52,CONCATENATE(\"(\",Ergebnismenge!C288,\", \",F295,\")\"))","v":0},null,null,null,null,null,null,{"$f":"IF(AND(SUM($G$99:G294)>0,G295>0),\", \",\"\")","v":""},"",null,null,null,null,null,null,""]
[null,null,2,null,null,"grau",{"$f":"COUNTIF(Kugeln!$X$4:$X$52,CONCATENATE(\"(\",Ergebnismenge!C289,\", \",F296,\")\"))","v":4},null,null,null,null,null,null,{"$f":"IF(AND(SUM($G$99:G295)>0,G296>0),\", \",\"\")","v":", "},"(grau, 2)",null,null,null,null,null,null,{"$f":"CONCATENATE(N296,O296)","v":", (grau, 2)"}]
[null,null,3,null,null,"grau",{"$f":"COUNTIF(Kugeln!$X$4:$X$52,CONCATENATE(\"(\",Ergebnismenge!C290,\", \",F297,\")\"))","v":1},null,null,null,null,null,null,{"$f":"IF(AND(SUM($G$99:G296)>0,G297>0),\", \",\"\")","v":", "},"(grau, 3)",null,null,null,null,null,null,", (grau, 3)"]
[null,null,4,null,null,"grau",{"$f":"COUNTIF(Kugeln!$X$4:$X$52,CONCATENATE(\"(\",Ergebnismenge!C291,\", \",F298,\")\"))","v":1},null,null,null,null,null,null,{"$f":"IF(AND(SUM($G$99:G297)>0,G298>0),\", \",\"\")","v":", "},"(grau, 4)",null,null,null,null,null,null,", (grau, 4)"]
[null,null,5,null,null,"grau",{"$f":"COUNTIF(Kugeln!$X$4:$X$52,CONCATENATE(\"(\",Ergebnismenge!C292,\", \",F299,\")\"))","v":2},null,null,null,null,null,null,{"$f":"IF(AND(SUM($G$99:G298)>0,G299>0),\", \",\"\")","v":", "},"(grau, 5)",null,null,null,null,null,null,", (grau, 5)"]
[null,null,6,null,null,"grau",{"$f":"COUNTIF(Kugeln!$X$4:$X$52,CONCATENATE(\"(\",Ergebnismenge!C293,\", \",F300,\")\"))","v":1},null,null,null,null,null,null,{"$f":"IF(AND(SUM($G$99:G299)>0,G300>0),\", \",\"\")","v":", "},"(grau, 6)",null,null,null,null,null,null,", (grau, 6)"]
[null,null,7,null,null,"grau",{"$f":"COUNTIF(Kugeln!$X$4:$X$52,CONCATENATE(\"(\",Ergebnismenge!C294,\", \",F301,\")\"))","v":2},null,null,null,null,null,null,{"$f":"IF(AND(SUM($G$99:G300)>0,G301>0),\", \",\"\")","v":", "},"(grau, 7)",null,null,null,null,null,null,", (grau, 7)"]
[null,null,8,null,null,"grau",{"$f":"COUNTIF(Kugeln!$X$4:$X$52,CONCATENATE(\"(\",Ergebnismenge!C295,\", \",F302,\")\"))","v":1},null,null,null,null,null,null,{"$f":"IF(AND(SUM($G$99:G301)>0,G302>0),\", \",\"\")","v":", "},"(grau, 8)",null,null,null,null,null,null,", (grau, 8)"]
[null,null,9,null,null,"grau",{"$f":"COUNTIF(Kugeln!$X$4:$X$52,CONCATENATE(\"(\",Ergebnismenge!C296,\", \",F303,\")\"))","v":0},null,null,null,null,null,null,{"$f":"IF(AND(SUM($G$99:G302)>0,G303>0),\", \",\"\")","v":""},"",null,null,null,null,null,null,""]
[null,null,10,null,null,"grau",{"$f":"COUNTIF(Kugeln!$X$4:$X$52,CONCATENATE(\"(\",Ergebnismenge!C297,\", \",F304,\")\"))","v":0},null,null,null,null,null,null,{"$f":"IF(AND(SUM($G$99:G303)>0,G304>0),\", \",\"\")","v":""},"",null,null,null,null,null,null,""]
[null,null,11,null,null,"grau",{"$f":"COUNTIF(Kugeln!$X$4:$X$52,CONCATENATE(\"(\",Ergebnismenge!C298,\", \",F305,\")\"))","v":0},null,null,null,null,null,null,{"$f":"IF(AND(SUM($G$99:G304)>0,G305>0),\", \",\"\")","v":""},"",null,null,null,null,null,null,""]
[null,null,12,null,null,"grau",{"$f":"COUNTIF(Kugeln!$X$4:$X$52,CONCATENATE(\"(\",Ergebnismenge!C299,\", \",F306,\")\"))","v":0},null,null,null,null,null,null,{"$f":"IF(AND(SUM($G$99:G305)>0,G306>0),\", \",\"\")","v":""},"",null,null,null,null,null,null,""]
[null,null,13,null,null,"grau",{"$f":"COUNTIF(Kugeln!$X$4:$X$52,CONCATENATE(\"(\",Ergebnismenge!C300,\", \",F307,\")\"))","v":0},null,null,null,null,null,null,{"$f":"IF(AND(SUM($G$99:G306)>0,G307>0),\", \",\"\")","v":""},"",null,null,null,null,null,null,""]
[null,null,14,null,null,"grau",{"$f":"COUNTIF(Kugeln!$X$4:$X$52,CONCATENATE(\"(\",Ergebnismenge!C301,\", \",F308,\")\"))","v":0},null,null,null,null,null,null,{"$f":"IF(AND(SUM($G$99:G307)>0,G308>0),\", \",\"\")","v":""},"",null,null,null,null,null,null,""]
[null,null,15,null,null,"grau",{"$f":"COUNTIF(Kugeln!$X$4:$X$52,CONCATENATE(\"(\",Ergebnismenge!C302,\", \",F309,\")\"))","v":0},null,null,null,null,null,null,{"$f":"IF(AND(SUM($G$99:G308)>0,G309>0),\", \",\"\")","v":""},"",null,null,null,null,null,null,""]
[null,null,16,null,null,"grau",{"$f":"COUNTIF(Kugeln!$X$4:$X$52,CONCATENATE(\"(\",Ergebnismenge!C303,\", \",F310,\")\"))","v":0},null,null,null,null,null,null,{"$f":"IF(AND(SUM($G$99:G309)>0,G310>0),\", \",\"\")","v":""},"",null,null,null,null,null,null,""]
[null,null,17,null,null,"grau",{"$f":"COUNTIF(Kugeln!$X$4:$X$52,CONCATENATE(\"(\",Ergebnismenge!C304,\", \",F311,\")\"))","v":0},null,null,null,null,null,null,{"$f":"IF(AND(SUM($G$99:G310)>0,G311>0),\", \",\"\")","v":""},"",null,null,null,null,null,null,""]
[null,null,18,null,null,"grau",{"$f":"COUNTIF(Kugeln!$X$4:$X$52,CONCATENATE(\"(\",Ergebnismenge!C305,\", \",F312,\")\"))","v":0},null,null,null,null,null,null,{"$f":"IF(AND(SUM($G$99:G311)>0,G312>0),\", \",\"\")","v":""},"",null,null,null,null,null,null,""]
[null,null,19,null,null,"grau",{"$f":"COUNTIF(Kugeln!$X$4:$X$52,CONCATENATE(\"(\",Ergebnismenge!C306,\", \",F313,\")\"))","v":0},null,null,null,null,null,null,{"$f":"IF(AND(SUM($G$99:G312)>0,G313>0),\", \",\"\")","v":""},"",null,null,null,null,null,null,""]
[null,null,20,null,null,"grau",{"$f":"COUNTIF(Kugeln!$X$4:$X$52,CONCATENATE(\"(\",Ergebnismenge!C307,\", \",F314,\")\"))","v":0},null,null,null,null,null,null,{"$f":"IF(AND(SUM($G$99:G313)>0,G314>0),\", \",\"\")","v":""},"",null,null,null,null,null,null,""]
[null,null,21,null,null,"grau",{"$f":"COUNTIF(Kugeln!$X$4:$X$52,CONCATENATE(\"(\",Ergebnismenge!C308,\", \",F315,\")\"))","v":0},null,null,null,null,null,null,{"$f":"IF(AND(SUM($G$99:G314)>0,G315>0),\", \",\"\")","v":""},"",null,null,null,null,null,null,""]
[null,null,22,null,null,"grau",{"$f":"COUNTIF(Kugeln!$X$4:$X$52,CONCATENATE(\"(\",Ergebnismenge!C309,\", \",F316,\")\"))","v":0},null,null,null,null,null,null,{"$f":"IF(AND(SUM($G$99:G315)>0,G316>0),\", \",\"\")","v":""},"",null,null,null,null,null,null,""]
[null,null,23,null,null,"grau",{"$f":"COUNTIF(Kugeln!$X$4:$X$52,CONCATENATE(\"(\",Ergebnismenge!C310,\", \",F317,\")\"))","v":0},null,null,null,null,null,null,{"$f":"IF(AND(SUM($G$99:G316)>0,G317>0),\", \",\"\")","v":""},"",null,null,null,null,null,null,""]
[null,null,24,null,null,"grau",{"$f":"COUNTIF(Kugeln!$X$4:$X$52,CONCATENATE(\"(\",Ergebnismenge!C311,\", \",F318,\")\"))","v":0},null,null,null,null,null,null,{"$f":"IF(AND(SUM($G$99:G317)>0,G318>0),\", \",\"\")","v":""},"",null,null,null,null,null,null,""]
[null,null,25,null,null,"grau",{"$f":"COUNTIF(Kugeln!$X$4:$X$52,CONCATENATE(\"(\",Ergebnismenge!C312,\", \",F319,\")\"))","v":0},null,null,null,null,null,null,{"$f":"IF(AND(SUM($G$99:G318)>0,G319>0),\", \",\"\")","v":""},"",null,null,null,null,null,null,""]
[null,null,26,null,null,"grau",{"$f":"COUNTIF(Kugeln!$X$4:$X$52,CONCATENATE(\"(\",Ergebnismenge!C313,\", \",F320,\")\"))","v":0},null,null,null,null,null,null,{"$f":"IF(AND(SUM($G$99:G319)>0,G320>0),\", \",\"\")","v":""},"",null,null,null,null,null,null,""]
[null,null,27,null,null,"grau",{"$f":"COUNTIF(Kugeln!$X$4:$X$52,CONCATENATE(\"(\",Ergebnismenge!C314,\", \",F321,\")\"))","v":0},null,null,null,null,null,null,{"$f":"IF(AND(SUM($G$99:G320)>0,G321>0),\", \",\"\")","v":""},"",null,null,null,null,null,null,""]
[null,null,28,null,null,"grau",{"$f":"COUNTIF(Kugeln!$X$4:$X$52,CONCATENATE(\"(\",Ergebnismenge!C315,\", \",F322,\")\"))","v":0},null,null,null,null,null,null,{"$f":"IF(AND(SUM($G$99:G321)>0,G322>0),\", \",\"\")","v":""},"",null,null,null,null,null,null,""]
[null,null,29,null,null,"grau",{"$f":"COUNTIF(Kugeln!$X$4:$X$52,CONCATENATE(\"(\",Ergebnismenge!C316,\", \",F323,\")\"))","v":0},null,null,null,null,null,null,{"$f":"IF(AND(SUM($G$99:G322)>0,G323>0),\", \",\"\")","v":""},"",null,null,null,null,null,null,""]
[null,null,30,null,null,"grau",{"$f":"COUNTIF(Kugeln!$X$4:$X$52,CONCATENATE(\"(\",Ergebnismenge!C317,\", \",F324,\")\"))","v":0},null,null,null,null,null,null,{"$f":"IF(AND(SUM($G$99:G323)>0,G324>0),\", \",\"\")","v":""},"",null,null,null,null,null,null,""]
[null,null,31,null,null,"grau",{"$f":"COUNTIF(Kugeln!$X$4:$X$52,CONCATENATE(\"(\",Ergebnismenge!C318,\", \",F325,\")\"))","v":0},null,null,null,null,null,null,{"$f":"IF(AND(SUM($G$99:G324)>0,G325>0),\", \",\"\")","v":""},"",null,null,null,null,null,null,""]
[null,null,32,null,null,"grau",{"$f":"COUNTIF(Kugeln!$X$4:$X$52,CONCATENATE(\"(\",Ergebnismenge!C319,\", \",F326,\")\"))","v":0},null,null,null,null,null,null,{"$f":"IF(AND(SUM($G$99:G325)>0,G326>0),\", \",\"\")","v":""},"",null,null,null,null,null,null,""]
[null,null,33,null,null,"grau",{"$f":"COUNTIF(Kugeln!$X$4:$X$52,CONCATENATE(\"(\",Ergebnismenge!C320,\", \",F327,\")\"))","v":0},null,null,null,null,null,null,{"$f":"IF(AND(SUM($G$99:G326)>0,G327>0),\", \",\"\")","v":""},"",null,null,null,null,null,null,""]
[null,null,34,null,null,"grau",{"$f":"COUNTIF(Kugeln!$X$4:$X$52,CONCATENATE(\"(\",Ergebnismenge!C321,\", \",F328,\")\"))","v":0},null,null,null,null,null,null,{"$f":"IF(AND(SUM($G$99:G327)>0,G328>0),\", \",\"\")","v":""},"",null,null,null,null,null,null,""]
[null,null,35,null,null,"grau",{"$f":"COUNTIF(Kugeln!$X$4:$X$52,CONCATENATE(\"(\",Ergebnismenge!C322,\", \",F329,\")\"))","v":0},null,null,null,null,null,null,{"$f":"IF(AND(SUM($G$99:G328)>0,G329>0),\", \",\"\")","v":""},"",null,null,null,null,null,null,""]
[null,null,36,null,null,"grau",{"$f":"COUNTIF(Kugeln!$X$4:$X$52,CONCATENATE(\"(\",Ergebnismenge!C323,\", \",F330,\")\"))","v":0},null,null,null,null,null,null,{"$f":"IF(AND(SUM($G$99:G329)>0,G330>0),\", \",\"\")","v":""},"",null,null,null,null,null,null,""]
[null,null,37,null,null,"grau",{"$f":"COUNTIF(Kugeln!$X$4:$X$52,CONCATENATE(\"(\",Ergebnismenge!C324,\", \",F331,\")\"))","v":0},null,null,null,null,null,null,{"$f":"IF(AND(SUM($G$99:G330)>0,G331>0),\", \",\"\")","v":""},"",null,null,null,null,null,null,""]
[null,null,38,null,null,"grau",{"$f":"COUNTIF(Kugeln!$X$4:$X$52,CONCATENATE(\"(\",Ergebnismenge!C325,\", \",F332,\")\"))","v":0},null,null,null,null,null,null,{"$f":"IF(AND(SUM($G$99:G331)>0,G332>0),\", \",\"\")","v":""},"",null,null,null,null,null,null,""]
[null,null,39,null,null,"grau",{"$f":"COUNTIF(Kugeln!$X$4:$X$52,CONCATENATE(\"(\",Ergebnismenge!C326,\", \",F333,\")\"))","v":0},null,null,null,null,null,null,{"$f":"IF(AND(SUM($G$99:G332)>0,G333>0),\", \",\"\")","v":""},"",null,null,null,null,null,null,""]
[null,null,40,null,null,"grau",{"$f":"COUNTIF(Kugeln!$X$4:$X$52,CONCATENATE(\"(\",Ergebnismenge!C327,\", \",F334,\")\"))","v":0},null,null,null,null,null,null,{"$f":"IF(AND(SUM($G$99:G333)>0,G334>0),\", \",\"\")","v":""},"",null,null,null,null,null,null,""]
[null,null,41,null,null,"grau",{"$f":"COUNTIF(Kugeln!$X$4:$X$52,CONCATENATE(\"(\",Ergebnismenge!C328,\", \",F335,\")\"))","v":0},null,null,null,null,null,null,{"$f":"IF(AND(SUM($G$99:G334)>0,G335>0),\", \",\"\")","v":""},"",null,null,null,null,null,null,""]
[null,null,42,null,null,"grau",{"$f":"COUNTIF(Kugeln!$X$4:$X$52,CONCATENATE(\"(\",Ergebnismenge!C329,\", \",F336,\")\"))","v":0},null,null,null,null,null,null,{"$f":"IF(AND(SUM($G$99:G335)>0,G336>0),\", \",\"\")","v":""},"",null,null,null,null,null,null,""]
[null,null,43,null,null,"grau",{"$f":"COUNTIF(Kugeln!$X$4:$X$52,CONCATENATE(\"(\",Ergebnismenge!C330,\", \",F337,\")\"))","v":0},null,null,null,null,null,null,{"$f":"IF(AND(SUM($G$99:G336)>0,G337>0),\", \",\"\")","v":""},"",null,null,null,null,null,null,""]
[null,null,44,null,null,"grau",{"$f":"COUNTIF(Kugeln!$X$4:$X$52,CONCATENATE(\"(\",Ergebnismenge!C331,\", \",F338,\")\"))","v":0},null,null,null,null,null,null,{"$f":"IF(AND(SUM($G$99:G337)>0,G338>0),\", \",\"\")","v":""},"",null,null,null,null,null,null,""]
[null,null,45,null,null,"grau",{"$f":"COUNTIF(Kugeln!$X$4:$X$52,CONCATENATE(\"(\",Ergebnismenge!C332,\", \",F339,\")\"))","v":0},null,null,null,null,null,null,{"$f":"IF(AND(SUM($G$99:G338)>0,G339>0),\", \",\"\")","v":""},"",null,null,null,null,null,null,""]
[null,null,46,null,null,"grau",{"$f":"COUNTIF(Kugeln!$X$4:$X$52,CONCATENATE(\"(\",Ergebnismenge!C333,\", \",F340,\")\"))","v":0},null,null,null,null,null,null,{"$f":"IF(AND(SUM($G$99:G339)>0,G340>0),\", \",\"\")","v":""},"",null,null,null,null,null,null,""]
[null,null,47,null,null,"grau",{"$f":"COUNTIF(Kugeln!$X$4:$X$52,CONCATENATE(\"(\",Ergebnismenge!C334,\", \",F341,\")\"))","v":0},null,null,null,null,null,null,{"$f":"IF(AND(SUM($G$99:G340)>0,G341>0),\", \",\"\")","v":""},"",null,null,null,null,null,null,""]
[null,null,48,null,null,"grau",{"$f":"COUNTIF(Kugeln!$X$4:$X$52,CONCATENATE(\"(\",Ergebnismenge!C335,\", \",F342,\")\"))","v":0},null,null,null,null,null,null,{"$f":"IF(AND(SUM($G$99:G341)>0,G342>0),\", \",\"\")","v":""},"",null,null,null,null,null,null,""]
[null,null,49,null,null,"grau",{"$f":"COUNTIF(Kugeln!$X$4:$X$52,CONCATENATE(\"(\",Ergebnismenge!C336,\", \",F343,\")\"))","v":0},null,null,null,null,null,null,{"$f":"IF(AND(SUM($G$99:G342)>0,G343>0),\", \",\"\")","v":""},"",null,null,null,null,null,null,""]
[]
[null,null,"Anzahl",null,null,null,{"$f":"SUM(G99:G343)","v":49}]
[]
[null,null,"|Ω| =",null,null,null,{"$f":"COUNTIF(G99:G343,\">0\")","v":31}]

{"sheet":"Ereignis-W. (1)","index":3,"n_rows":370,"n_cols":47,"rows_kept":370,"cut":false,"hidden":false,"merged":[[51,39,52,39],[51,40,52,40],[20,6,20,9],[22,6,22,9],[24,6,24,9],[26,6,26,9],[28,6,28,9],[30,6,30,9],[51,29,52,29],[51,31,52,32],[51,33,52,33],[51,34,52,34],[51,36,52,36],[51,38,52,38],[45,39,46,39],[45,40,46,40],[48,38,49,38],[48,39,49,39],[48,40,49,40],[45,29,46,29],[45,31,46,32],[45,33,46,33],[45,34,46,34],[45,36,46,36],[45,38,46,38],[48,29,49,29],[48,31,49,32],[48,33,49,33],[48,34,49,34],[48,36,49,36],[39,40,40,40],[40,42,41,43],[42,29,43,29],[42,31,43,32],[42,33,43,33],[42,34,43,34],[42,36,43,36],[42,38,43,38],[42,39,43,39],[42,40,43,40],[36,39,37,39],[36,40,37,40],[36,41,37,41],[39,29,40,29],[39,31,40,32],[39,33,40,33],[39,34,40,34],[39,36,40,36],[39,38,40,38],[39,39,40,39],[36,29,37,29],[36,31,37,32],[36,33,37,33],[36,34,37,34],[36,36,37,36],[36,38,37,38]]}
[]
[null,null,null,null,null,null,null,null,null,null,null,null,null,null,null,null,null,null,null,null,null,null,null,null,null,null,null,null,null,null,null,null,null,null,null,null,null,null,null,null,null,null,null,null,false,null,false]
[null,"Gefäß mit Kugeln: ",null,null,null,null,null,null,null,{"$f":"Kugeln!Y54","v":49},"Stück",null,null,null,null,null,null,null,null,null,null,null,null,null,null,null,null,null,null,"Ereignis-Wahrscheinlichkeiten (1)"]
[]
[null,null,{"$f":"Kugeln!Z4","v":"grün"},1,null,null,{"$f":"Kugeln!Z11","v":"grün"},8,null,null,{"$f":"Kugeln!Z18","v":"gelb"},15,null,null,{"$f":"Kugeln!Z25","v":"rot"},22,null,null,{"$f":"Kugeln!Z32","v":"rot"},29,null,null,{"$f":"Kugeln!Z39","v":"blau"},36,null,null,{"$f":"Kugeln!Z46","v":"blau"},43,null,"1.  Es wird 1-mal gezogen, Beobachtungskriterium: Farbe"]
[]
[null,null,{"$f":"Kugeln!Z5","v":"grün"},2,null,null,{"$f":"Kugeln!Z12","v":"gelb"},9,null,null,{"$f":"Kugeln!Z19","v":"gelb"},16,null,null,{"$f":"Kugeln!Z26","v":"grau"},23,null,null,{"$f":"Kugeln!Z33","v":"gelb"},30,null,null,{"$f":"Kugeln!Z40","v":"grau"},37,null,null,{"$f":"Kugeln!Z47","v":"grau"},44,null,"Ω   =",{"$f":"CONCATENATE(\"{\",V60,V61,V62,V63,V64,\"}\")","v":"{rot, grün, blau, gelb, grau}"}]
[]
[null,null,{"$f":"Kugeln!Z6","v":"grün"},3,null,null,{"$f":"Kugeln!Z13","v":"gelb"},10,null,null,{"$f":"Kugeln!Z20","v":"rot"},17,null,null,{"$f":"Kugeln!Z27","v":"grün"},24,null,null,{"$f":"Kugeln!Z34","v":"grau"},31,null,null,{"$f":"Kugeln!Z41","v":"grün"},38,null,null,{"$f":"Kugeln!Z48","v":"grün"},45,null,"|Ω| =",{"$f":"G65","v":5}]
[]
[null,null,{"$f":"Kugeln!Z7","v":"grau"},4,null,null,{"$f":"Kugeln!Z14","v":"grün"},11,null,null,{"$f":"Kugeln!Z21","v":"grau"},18,null,null,{"$f":"Kugeln!Z28","v":"grau"},25,null,null,{"$f":"Kugeln!Z35","v":"blau"},32,null,null,{"$f":"Kugeln!Z42","v":"grün"},39,null,null,{"$f":"Kugeln!Z49","v":"grün"},46]
[null,null,null,null,null,null,null,null,null,null,null,null,null,null,null,null,null,null,null,null,null,null,null,null,null,null,null,null,null,"(Elementar-)Ereignisse:"]
[null,null,{"$f":"Kugeln!Z8","v":"grün"},5,null,null,{"$f":"Kugeln!Z15","v":"grau"},12,null,null,{"$f":"Kugeln!Z22","v":"blau"},19,null,null,{"$f":"Kugeln!Z29","v":"blau"},26,null,null,{"$f":"Kugeln!Z36","v":"rot"},33,null,null,{"$f":"Kugeln!Z43","v":"rot"},40,null,null,{"$f":"Kugeln!Z50","v":"grau"},47]
[null,null,null,null,null,null,null,null,null,null,null,null,null,null,null,null,null,null,null,null,null,null,null,null,null,null,null,null,null,null,"A",null,":","Es wird eine rote Kugel gezogen.",null,null,null,null,"⇒","P(A)","≅",{"$f":"G21","v":0.12244897959183673},null,null,null,{"$f":"IF(OR(AM37=0,AM37=MAX($AM$37:$AM$50)),1,0)","v":0}]
[null,null,{"$f":"Kugeln!Z9","v":"gelb"},6,null,null,{"$f":"Kugeln!Z16","v":"grau"},13,null,null,{"$f":"Kugeln!Z23","v":"gelb"},20,null,null,{"$f":"Kugeln!Z30","v":"grün"},27,null,null,{"$f":"Kugeln!Z37","v":"grün"},34,null,null,{"$f":"Kugeln!Z44","v":"rot"},41,null,null,{"$f":"Kugeln!Z51","v":"gelb"},48]
[null,null,null,null,null,null,null,null,null,null,null,null,null,null,null,null,null,null,null,null,null,null,null,null,null,null,null,null,null,null,"B",null,":","Es wird eine grüne Kugel gezogen.",null,null,null,null,"⇒","P(B)","≅",{"$f":"G23","v":0.30612244897959184}]
[null,null,{"$f":"Kugeln!Z10","v":"blau"},7,null,null,{"$f":"Kugeln!Z17","v":"grau"},14,null,null,{"$f":"Kugeln!Z24","v":"grün"},21,null,null,{"$f":"Kugeln!Z31","v":"grau"},28,null,null,{"$f":"Kugeln!Z38","v":"grün"},35,null,null,{"$f":"Kugeln!Z45","v":"gelb"},42,null,null,{"$f":"Kugeln!Z52","v":"blau"},49,null,null,null,null,null,null,null,null,null,null,null,null,null,null,null,null,null,{"$f":"IF(OR(AM40=0,AM40=MAX($AM$37:$AM$50)),1,0)","v":1}]
[null,null,null,null,null,null,null,null,null,null,null,null,null,null,null,null,null,null,null,null,null,null,null,null,null,null,null,null,null,null,"C",null,":","Es wird eine blaue Kugel gezogen.",null,null,null,null,"⇒","P(C)","≅",{"$f":"G25","v":0.14285714285714285}]
[null,null,null,null,false]
[null,null,null,null,null,null,null,null,null,null,null,null,null,null,null,null,null,null,null,null,null,null,null,null,null,null,null,null,null,null,"D",null,":","Es wird eine gelbe Kugel gezogen.",null,null,null,null,"⇒","P(D)","≅",{"$f":"G27","v":0.18367346938775511},null,null,null,{"$f":"IF(OR(AM43=0,AM43=MAX($AM$37:$AM$50)),1,0)","v":0}]
[null,{"$f":"AH37","v":"P(rot)"},null,null,null,"≅",{"$f":"AM37","v":0.12244897959183673}]
[null,null,null,null,null,null,null,null,null,null,null,null,null,null,null,null,null,null,null,null,null,null,null,null,null,null,null,null,null,null,"E",null,":","Es wird eine graue Kugel gezogen.",null,null,null,null,"⇒","P(E)","≅",{"$f":"G29","v":0.24489795918367346}]
[null,{"$f":"AH40","v":"P(grün)"},null,null,null,"≅",{"$f":"AM40","v":0.30612244897959184}]
[]
[null,{"$f":"AH43","v":"P(blau)"},null,null,null,"≅",{"$f":"AM43","v":0.14285714285714285},null,null,null,null,null,null,null,null,null,null,null,null,null,null,null,null,null,null,null,null,null,null,"Verknüpfung von Ereignissen:"]
[]
[null,{"$f":"AH46","v":"P(gelb)"},null,null,null,"≅",{"$f":"AM46","v":0.18367346938775511},null,null,null,null,null,null,null,null,null,null,null,null,null,null,null,null,null,null,null,null,null,null,"A"," ∪ ","B",":","Es wird eine ",{"$f":"IF(AD27=\"A\",\"rote\", IF(AD27=\"B\",\"grüne\",IF(AD27=\"C\",\"blaue\",IF(AD27=\"D\",\"gelbe\",IF(AD27=\"E\",\"graue\",\"\")))))","v":"rote"},"ODER",{"$f":"IF(AF27=\"A\",\"rote\", IF(AF27=\"B\",\"grüne\",IF(AF27=\"C\",\"blaue\",IF(AF27=\"D\",\"gelbe\",IF(AF27=\"E\",\"graue\",\"\")))))","v":"grüne"},"Kugel gezogen.","⇒",{"$f":"CONCATENATE(\"P(\",AD27,AE27,AF27,\")\")","v":"P(A ∪ B)"},"≅",{"$f":"CONCATENATE(\"P(\",AD27,\")\" )","v":"P(A)"},"+",{"$f":"CONCATENATE(\" P(\",AF27,\")\")","v":" P(B)"},"-",{"$f":"CONCATENATE(\"P(\",AD27,\" ∩ \",AF27,\")\")","v":"P(A ∩ B)"}]
[]
[null,{"$f":"AH49","v":"P(grau)"},null,null,null,"≅",{"$f":"AM49","v":0.24489795918367346},null,null,null,null,null,null,null,null,null,null,null,null,null,null,null,null,null,null,null,null,null,null,null,null,null,null,null,null,null,null,null,null,null,"≅",{"$f":"IF(AD27=\"A\",$AP$14,IF(AD27=\"B\",$AP$16,IF(AD27=\"C\",$AP$18,IF(AD27=\"D\",$AP$20,IF(AD27=\"E\",$AP$22)))))","v":0.12244897959183673},"+",{"$f":"IF(AF27=\"A\",$AP$14,IF(AF27=\"B\",$AP$16,IF(AF27=\"C\",$AP$18,IF(AF27=\"D\",$AP$20,IF(AF27=\"E\",$AP$22)))))","v":0.30612244897959184},"-",{"$f":"IF(AD27=AF27,AP29,0)","v":0}]
[]
[null,"P(Ω)",null,null,null,"≅",{"$f":"SUM(G21:J29)","v":1},null,null,null,null,null,null,null,null,null,null,null,null,null,null,null,null,null,null,null,null,null,null,null,null,null,null,null,null,null,null,null,null,null,"≅",{"$f":"AP29+AR29-AT29","v":0.4285714285714286},null,null,null,{"$f":"IF(OR(AM46=0,AM46=MAX($AM$37:$AM$50)),1,0)","v":0}]
[null,null,null,null,null,null,null,null,null,null,null,null,null,null,null,null,null,null,null,null,null,null,null,null,null,null,null,null,null,null,null,null,null,null,null,null,null,null,null,null,null,null,null,null,null,{"$f":"IF(OR(AM49=0,AM49=MAX($AM$37:$AM$50)),1,0)","v":0}]
[]
[]
[]
[]
[null,null,null,null,null,null,null,null,null,null,null,null,null,null,null,null,null,null,null,null,null,null,null,null,null,null,null,null,null,{"$f":"G60","v":6},null,"rote Kugeln",null,"P(rot)","=",{"$f":"AD37","v":6},"≅",null,{"$f":"AJ37/AJ38","v":0.12244897959183673},"≅",{"$f":"AM37","v":0.12244897959183673},null,null,null,null,null,"A"]
[null,null,null,null,null,null,null,null,null,null,null,null,null,null,null,null,null,null,null,null,null,null,null,null,null,null,null,null,null,null,null,null,null,null,null,{"$f":"$AD$52","v":49},null,null,null,null,null,null,null,null,null,null,"B"]
[null,null,null,null,null,null,null,null,null,null,null,null,null,null,null,null,null,null,null,null,null,null,null,null,null,null,null,null,null,null,null,null,null,null,null,null,null,null,null,null,null,null,null,null,null,null,"C"]
[null,null,null,null,null,null,null,null,null,null,null,null,null,null,null,null,null,null,null,null,null,null,null,null,null,null,null,null,null,{"$f":"G61","v":15},null,"grüne Kugeln",null,"P(grün)","=",{"$f":"AD40","v":15},"≅",null,{"$f":"AJ40/AJ41","v":0.30612244897959184},"≅",{"$f":"AM40","v":0.30612244897959184},null,null,null,null,null,"D"]
[null,null,null,null,null,null,null,null,null,null,null,null,null,null,null,null,null,null,null,null,null,null,null,null,null,null,null,null,null,null,null,null,null,null,null,{"$f":"$AD$52","v":49},null,null,null,null,null,null,"Alle Ergebnisse gleichwahrscheinlich:",null,null,null,"E"]
[null,null,null,null,null,null,null,null,null,null,null,null,null,null,null,null,null,null,null,null,null,null,null,null,null,null,null,null,null,null,null,null,null,null,null,null,null,null,null,null,null,null,null,null,{"$f":"IF(SUM(AT14:AT32)=5,\"ja\",\"nein\")","v":"nein"}]
[null,null,null,null,null,null,null,null,null,null,null,null,null,null,null,null,null,null,null,null,null,null,null,null,null,null,null,null,null,{"$f":"G62","v":7},null,"blaue Kugeln",null,"P(blau)","=",{"$f":"AD43","v":7},"≅",null,{"$f":"AJ43/AJ44","v":0.14285714285714285},"≅",{"$f":"AM43","v":0.14285714285714285}]
[null,null,null,null,null,null,null,null,null,null,null,null,null,null,null,null,null,null,null,null,null,null,null,null,null,null,null,null,null,null,null,null,null,null,null,{"$f":"$AD$52","v":49}]
[null,null,null,null,null,null,null,null,null,null,null,null,null,null,null,null,null,null,null,null,null,null,null,null,null,null,null,null,null,null,null,null,null,null,null,null,null,null,null,null,null,null,"⇒",{"$f":"IF(AS42=\"ja\",\"Laplace-Experiment\", \"KEIN Laplace-Experiment\")","v":"KEIN Laplace-Experiment"}]
[null,null,null,null,null,null,null,null,null,null,null,null,null,null,null,null,null,null,null,null,null,null,null,null,null,null,null,null,null,{"$f":"G63","v":9},null,"gelbe Kugeln",null,"P(gelb)","=",{"$f":"AD46","v":9},"≅",null,{"$f":"AJ46/AJ47","v":0.18367346938775511},"≅",{"$f":"AM46","v":0.18367346938775511}]
[null,null,null,null,null,null,null,null,null,null,null,null,null,null,null,null,null,null,null,null,null,null,null,null,null,null,null,null,null,null,null,null,null,null,null,{"$f":"$AD$52","v":49}]
[]
[null,null,null,null,null,null,null,null,null,null,null,null,null,null,null,null,null,null,null,null,null,null,null,null,null,null,null,null,null,{"$f":"G64","v":12},null,"graue Kugeln",null,"P(grau)","=",{"$f":"AD49","v":12},"≅",null,{"$f":"AJ49/AJ50","v":0.24489795918367346},"≅",{"$f":"AM49","v":0.24489795918367346}]
[null,null,null,null,null,null,null,null,null,null,null,null,null,null,null,null,null,null,null,null,null,null,null,null,null,null,null,null,null,null,null,null,null,null,null,{"$f":"$AD$52","v":49}]
[]
[null,null,null,null,null,null,null,null,null,null,null,null,null,null,null,null,null,null,null,null,null,null,null,null,null,null,null,null,null,{"$f":"SUM(AD37:AD49)","v":49},null,"Kugeln (gesamt)",null,"P(gesamt)","=",{"$f":"AD52","v":49},"≅",null,{"$f":"AJ52/AJ53","v":1},"≅",{"$f":"AM52","v":1}]
[null,null,null,null,null,null,null,null,null,null,null,null,null,null,null,null,null,null,null,null,null,null,null,null,null,null,null,null,null,null,null,null,null,null,null,{"$f":"$AD$52","v":49}]
[]
[]
[]
[]
[null,"Anzahl Farben:"]
[]
[null,null,"rot",null,null,null,{"$f":"COUNTIF(Kugeln!$Y$4:$Z$52,Ergebnismenge!C30)","v":6},null,null,null,null,null,null,null,{"$f":"IF(G60>0,C60,\"\")","v":"rot"},null,null,null,null,null,null,{"$f":"CONCATENATE(N60,O60)","v":"rot"}]
[null,null,"grün",null,null,null,{"$f":"COUNTIF(Kugeln!$Y$4:$Z$52,Ergebnismenge!C31)","v":15},null,null,null,null,null,null,{"$f":"IF(AND(SUM($G$60:G60)>0,G61>0),\", \",\"\")","v":", "},{"$f":"IF(G61>0,C61,\"\")","v":"grün"},null,null,null,null,null,null,{"$f":"CONCATENATE(N61,O61)","v":", grün"}]
[null,null,"blau",null,null,null,{"$f":"COUNTIF(Kugeln!$Y$4:$Z$52,Ergebnismenge!C32)","v":7},null,null,null,null,null,null,{"$f":"IF(AND(SUM($G$60:G61)>0,G62>0),\", \",\"\")","v":", "},{"$f":"IF(G62>0,C62,\"\")","v":"blau"},null,null,null,null,null,null,", blau"]
[null,null,"gelb",null,null,null,{"$f":"COUNTIF(Kugeln!$Y$4:$Z$52,Ergebnismenge!C33)","v":9},null,null,null,null,null,null,{"$f":"IF(AND(SUM($G$60:G62)>0,G63>0),\", \",\"\")","v":", "},{"$f":"IF(G63>0,C63,\"\")","v":"gelb"},null,null,null,null,null,null,", gelb"]
[null,null,"grau",null,null,null,{"$f":"COUNTIF(Kugeln!$Y$4:$Z$52,Ergebnismenge!C34)","v":12},null,null,null,null,null,null,{"$f":"IF(AND(SUM($G$60:G63)>0,G64>0),\", \",\"\")","v":", "},{"$f":"IF(G64>0,C64,\"\")","v":"grau"},null,null,null,null,null,null,", grau"]
[null,null,"|Ω| =",null,null,null,{"$f":"COUNTIF(G60:G64,\">0\")","v":5}]
[]
[null,"Anzahl Zahlen:"]
[]
[null,null,1,null,null,null,{"$f":"COUNTIF(Kugeln!$Y$4:$Z$52,Ergebnismenge!C39)","v":0},null,null,null,null,null,null,null,{"$f":"IF(G69>0,C69,\"\")","v":""},null,null,null,null,null,null,""]
[null,null,2,null,null,null,{"$f":"COUNTIF(Kugeln!$Y$4:$Z$52,Ergebnismenge!C40)","v":8},null,null,null,null,null,null,{"$f":"IF(AND(SUM($G$69:G69)>0,G70>0),\", \",\"\")","v":""},2,null,null,null,null,null,null,"2"]
[null,null,3,null,null,null,{"$f":"COUNTIF(Kugeln!$Y$4:$Z$52,Ergebnismenge!C41)","v":3},null,null,null,null,null,null,{"$f":"IF(AND(SUM($G$69:G70)>0,G71>0),\", \",\"\")","v":", "},3,null,null,null,null,null,null,", 3"]
[null,null,4,null,null,null,{"$f":"COUNTIF(Kugeln!$Y$4:$Z$52,Ergebnismenge!C42)","v":5},null,null,null,null,null,null,{"$f":"IF(AND(SUM($G$69:G71)>0,G72>0),\", \",\"\")","v":", "},4,null,null,null,null,null,null,", 4"]
[null,null,5,null,null,null,{"$f":"COUNTIF(Kugeln!$Y$4:$Z$52,Ergebnismenge!C43)","v":7},null,null,null,null,null,null,{"$f":"IF(AND(SUM($G$69:G72)>0,G73>0),\", \",\"\")","v":", "},5,null,null,null,null,null,null,", 5"]
[null,null,6,null,null,null,{"$f":"COUNTIF(Kugeln!$Y$4:$Z$52,Ergebnismenge!C44)","v":7},null,null,null,null,null,null,{"$f":"IF(AND(SUM($G$69:G73)>0,G74>0),\", \",\"\")","v":", "},6,null,null,null,null,null,null,", 6"]
[null,null,7,null,null,null,{"$f":"COUNTIF(Kugeln!$Y$4:$Z$52,Ergebnismenge!C45)","v":7},null,null,null,null,null,null,{"$f":"IF(AND(SUM($G$69:G74)>0,G75>0),\", \",\"\")","v":", "},7,null,null,null,null,null,null,", 7"]
[null,null,8,null,null,null,{"$f":"COUNTIF(Kugeln!$Y$4:$Z$52,Ergebnismenge!C46)","v":6},null,null,null,null,null,null,{"$f":"IF(AND(SUM($G$69:G75)>0,G76>0),\", \",\"\")","v":", "},8,null,null,null,null,null,null,", 8"]
[null,null,9,null,null,null,{"$f":"COUNTIF(Kugeln!$Y$4:$Z$52,Ergebnismenge!C47)","v":6},null,null,null,null,null,null,{"$f":"IF(AND(SUM($G$69:G76)>0,G77>0),\", \",\"\")","v":", "},9,null,null,null,null,null,null,", 9"]
[null,null,10,null,null,null,{"$f":"COUNTIF(Kugeln!$Y$4:$Z$52,Ergebnismenge!C48)","v":0},null,null,null,null,null,null,{"$f":"IF(AND(SUM($G$69:G77)>0,G78>0),\", \",\"\")","v":""},"",null,null,null,null,null,null,""]
[null,null,11,null,null,null,{"$f":"COUNTIF(Kugeln!$Y$4:$Z$52,Ergebnismenge!C49)","v":0},null,null,null,null,null,null,{"$f":"IF(AND(SUM($G$69:G78)>0,G79>0),\", \",\"\")","v":""},"",null,null,null,null,null,null,""]
[null,null,12,null,null,null,{"$f":"COUNTIF(Kugeln!$Y$4:$Z$52,Ergebnismenge!C50)","v":0},null,null,null,null,null,null,{"$f":"IF(AND(SUM($G$69:G79)>0,G80>0),\", \",\"\")","v":""},"",null,null,null,null,null,null,""]
[null,null,13,null,null,null,{"$f":"COUNTIF(Kugeln!$Y$4:$Z$52,Ergebnismenge!C51)","v":0},null,null,null,null,null,null,{"$f":"IF(AND(SUM($G$69:G80)>0,G81>0),\", \",\"\")","v":""},"",null,null,null,null,null,null,""]
[null,null,14,null,null,null,{"$f":"COUNTIF(Kugeln!$Y$4:$Z$52,Ergebnismenge!C52)","v":0},null,null,null,null,null,null,{"$f":"IF(AND(SUM($G$69:G81)>0,G82>0),\", \",\"\")","v":""},"",null,null,null,null,null,null,""]
[null,null,15,null,null,null,{"$f":"COUNTIF(Kugeln!$Y$4:$Z$52,Ergebnismenge!C53)","v":0},null,null,null,null,null,null,{"$f":"IF(AND(SUM($G$69:G82)>0,G83>0),\", \",\"\")","v":""},"",null,null,null,null,null,null,""]
[null,null,16,null,null,null,{"$f":"COUNTIF(Kugeln!$Y$4:$Z$52,Ergebnismenge!C54)","v":0},null,null,null,null,null,null,{"$f":"IF(AND(SUM($G$69:G83)>0,G84>0),\", \",\"\")","v":""},"",null,null,null,null,null,null,""]
[null,null,17,null,null,null,{"$f":"COUNTIF(Kugeln!$Y$4:$Z$52,Ergebnismenge!C55)","v":0},null,null,null,null,null,null,{"$f":"IF(AND(SUM($G$69:G84)>0,G85>0),\", \",\"\")","v":""},"",null,null,null,null,null,null,""]
[null,null,18,null,null,null,{"$f":"COUNTIF(Kugeln!$Y$4:$Z$52,Ergebnismenge!C56)","v":0},null,null,null,null,null,null,{"$f":"IF(AND(SUM($G$69:G85)>0,G86>0),\", \",\"\")","v":""},"",null,null,null,null,null,null,""]
[null,null,19,null,null,null,{"$f":"COUNTIF(Kugeln!$Y$4:$Z$52,Ergebnismenge!C57)","v":0},null,null,null,null,null,null,{"$f":"IF(AND(SUM($G$69:G86)>0,G87>0),\", \",\"\")","v":""},"",null,null,null,null,null,null,""]
[null,null,20,null,null,null,{"$f":"COUNTIF(Kugeln!$Y$4:$Z$52,Ergebnismenge!C58)","v":0},null,null,null,null,null,null,{"$f":"IF(AND(SUM($G$69:G87)>0,G88>0),\", \",\"\")","v":""},"",null,null,null,null,null,null,""]
[null,null,21,null,null,null,{"$f":"COUNTIF(Kugeln!$Y$4:$Z$52,Ergebnismenge!C59)","v":0},null,null,null,null,null,null,{"$f":"IF(AND(SUM($G$69:G88)>0,G89>0),\", \",\"\")","v":""},"",null,null,null,null,null,null,""]
[null,null,22,null,null,null,{"$f":"COUNTIF(Kugeln!$Y$4:$Z$52,Ergebnismenge!C60)","v":0},null,null,null,null,null,null,{"$f":"IF(AND(SUM($G$69:G89)>0,G90>0),\", \",\"\")","v":""},"",null,null,null,null,null,null,""]
[null,null,23,null,null,null,{"$f":"COUNTIF(Kugeln!$Y$4:$Z$52,Ergebnismenge!C61)","v":0},null,null,null,null,null,null,{"$f":"IF(AND(SUM($G$69:G90)>0,G91>0),\", \",\"\")","v":""},"",null,null,null,null,null,null,""]
[null,null,24,null,null,null,{"$f":"COUNTIF(Kugeln!$Y$4:$Z$52,Ergebnismenge!C62)","v":0},null,null,null,null,null,null,{"$f":"IF(AND(SUM($G$69:G91)>0,G92>0),\", \",\"\")","v":""},"",null,null,null,null,null,null,""]
[null,null,25,null,null,null,{"$f":"COUNTIF(Kugeln!$Y$4:$Z$52,Ergebnismenge!C63)","v":0},null,null,null,null,null,null,{"$f":"IF(AND(SUM($G$69:G92)>0,G93>0),\", \",\"\")","v":""},"",null,null,null,null,null,null,""]
[null,null,26,null,null,null,{"$f":"COUNTIF(Kugeln!$Y$4:$Z$52,Ergebnismenge!C64)","v":0},null,null,null,null,null,null,{"$f":"IF(AND(SUM($G$69:G93)>0,G94>0),\", \",\"\")","v":""},"",null,null,null,null,null,null,""]
[null,null,27,null,null,null,{"$f":"COUNTIF(Kugeln!$Y$4:$Z$52,Ergebnismenge!C65)","v":0},null,null,null,null,null,null,{"$f":"IF(AND(SUM($G$69:G94)>0,G95>0),\", \",\"\")","v":""},"",null,null,null,null,null,null,""]
[null,null,28,null,null,null,{"$f":"COUNTIF(Kugeln!$Y$4:$Z$52,Ergebnismenge!C66)","v":0},null,null,null,null,null,null,{"$f":"IF(AND(SUM($G$69:G95)>0,G96>0),\", \",\"\")","v":""},"",null,null,null,null,null,null,""]
[null,null,29,null,null,null,{"$f":"COUNTIF(Kugeln!$Y$4:$Z$52,Ergebnismenge!C67)","v":0},null,null,null,null,null,null,{"$f":"IF(AND(SUM($G$69:G96)>0,G97>0),\", \",\"\")","v":""},"",null,null,null,null,null,null,""]
[null,null,30,null,null,null,{"$f":"COUNTIF(Kugeln!$Y$4:$Z$52,Ergebnismenge!C68)","v":0},null,null,null,null,null,null,{"$f":"IF(AND(SUM($G$69:G97)>0,G98>0),\", \",\"\")","v":""},"",null,null,null,null,null,null,""]
[null,null,31,null,null,null,{"$f":"COUNTIF(Kugeln!$Y$4:$Z$52,Ergebnismenge!C69)","v":0},null,null,null,null,null,null,{"$f":"IF(AND(SUM($G$69:G98)>0,G99>0),\", \",\"\")","v":""},"",null,null,null,null,null,null,""]
[null,null,32,null,null,null,{"$f":"COUNTIF(Kugeln!$Y$4:$Z$52,Ergebnismenge!C70)","v":0},null,null,null,null,null,null,{"$f":"IF(AND(SUM($G$69:G99)>0,G100>0),\", \",\"\")","v":""},"",null,null,null,null,null,null,""]
[null,null,33,null,null,null,{"$f":"COUNTIF(Kugeln!$Y$4:$Z$52,Ergebnismenge!C71)","v":0},null,null,null,null,null,null,{"$f":"IF(AND(SUM($G$69:G100)>0,G101>0),\", \",\"\")","v":""},{"$f":"IF(G101>0,C101,\"\")","v":""},null,null,null,null,null,null,""]
[null,null,34,null,null,null,{"$f":"COUNTIF(Kugeln!$Y$4:$Z$52,Ergebnismenge!C72)","v":0},null,null,null,null,null,null,{"$f":"IF(AND(SUM($G$69:G101)>0,G102>0),\", \",\"\")","v":""},"",null,null,null,null,null,null,""]
[null,null,35,null,null,null,{"$f":"COUNTIF(Kugeln!$Y$4:$Z$52,Ergebnismenge!C73)","v":0},null,null,null,null,null,null,{"$f":"IF(AND(SUM($G$69:G102)>0,G103>0),\", \",\"\")","v":""},"",null,null,null,null,null,null,""]
[null,null,36,null,null,null,{"$f":"COUNTIF(Kugeln!$Y$4:$Z$52,Ergebnismenge!C74)","v":0},null,null,null,null,null,null,{"$f":"IF(AND(SUM($G$69:G103)>0,G104>0),\", \",\"\")","v":""},"",null,null,null,null,null,null,""]
[null,null,37,null,null,null,{"$f":"COUNTIF(Kugeln!$Y$4:$Z$52,Ergebnismenge!C75)","v":0},null,null,null,null,null,null,{"$f":"IF(AND(SUM($G$69:G104)>0,G105>0),\", \",\"\")","v":""},"",null,null,null,null,null,null,""]
[null,null,38,null,null,null,{"$f":"COUNTIF(Kugeln!$Y$4:$Z$52,Ergebnismenge!C76)","v":0},null,null,null,null,null,null,{"$f":"IF(AND(SUM($G$69:G105)>0,G106>0),\", \",\"\")","v":""},"",null,null,null,null,null,null,""]
[null,null,39,null,null,null,{"$f":"COUNTIF(Kugeln!$Y$4:$Z$52,Ergebnismenge!C77)","v":0},null,null,null,null,null,null,{"$f":"IF(AND(SUM($G$69:G106)>0,G107>0),\", \",\"\")","v":""},"",null,null,null,null,null,null,""]
[null,null,40,null,null,null,{"$f":"COUNTIF(Kugeln!$Y$4:$Z$52,Ergebnismenge!C78)","v":0},null,null,null,null,null,null,{"$f":"IF(AND(SUM($G$69:G107)>0,G108>0),\", \",\"\")","v":""},"",null,null,null,null,null,null,""]
[null,null,41,null,null,null,{"$f":"COUNTIF(Kugeln!$Y$4:$Z$52,Ergebnismenge!C79)","v":0},null,null,null,null,null,null,{"$f":"IF(AND(SUM($G$69:G108)>0,G109>0),\", \",\"\")","v":""},"",null,null,null,null,null,null,""]
[null,null,42,null,null,null,{"$f":"COUNTIF(Kugeln!$Y$4:$Z$52,Ergebnismenge!C80)","v":0},null,null,null,null,null,null,{"$f":"IF(AND(SUM($G$69:G109)>0,G110>0),\", \",\"\")","v":""},"",null,null,null,null,null,null,""]
[null,null,43,null,null,null,{"$f":"COUNTIF(Kugeln!$Y$4:$Z$52,Ergebnismenge!C81)","v":0},null,null,null,null,null,null,{"$f":"IF(AND(SUM($G$69:G110)>0,G111>0),\", \",\"\")","v":""},"",null,null,null,null,null,null,""]
[null,null,44,null,null,null,{"$f":"COUNTIF(Kugeln!$Y$4:$Z$52,Ergebnismenge!C82)","v":0},null,null,null,null,null,null,{"$f":"IF(AND(SUM($G$69:G111)>0,G112>0),\", \",\"\")","v":""},"",null,null,null,null,null,null,""]
[null,null,45,null,null,null,{"$f":"COUNTIF(Kugeln!$Y$4:$Z$52,Ergebnismenge!C83)","v":0},null,null,null,null,null,null,{"$f":"IF(AND(SUM($G$69:G112)>0,G113>0),\", \",\"\")","v":""},"",null,null,null,null,null,null,""]
[null,null,46,null,null,null,{"$f":"COUNTIF(Kugeln!$Y$4:$Z$52,Ergebnismenge!C84)","v":0},null,null,null,null,null,null,{"$f":"IF(AND(SUM($G$69:G113)>0,G114>0),\", \",\"\")","v":""},"",null,null,null,null,null,null,""]
[null,null,47,null,null,null,{"$f":"COUNTIF(Kugeln!$Y$4:$Z$52,Ergebnismenge!C85)","v":0},null,null,null,null,null,null,{"$f":"IF(AND(SUM($G$69:G114)>0,G115>0),\", \",\"\")","v":""},"",null,null,null,null,null,null,""]
[null,null,48,null,null,null,{"$f":"COUNTIF(Kugeln!$Y$4:$Z$52,Ergebnismenge!C86)","v":0},null,null,null,null,null,null,{"$f":"IF(AND(SUM($G$69:G115)>0,G116>0),\", \",\"\")","v":""},"",null,null,null,null,null,null,""]
[null,null,49,null,null,null,{"$f":"COUNTIF(Kugeln!$Y$4:$Z$52,Ergebnismenge!C87)","v":0},null,null,null,null,null,null,{"$f":"IF(AND(SUM($G$69:G116)>0,G117>0),\", \",\"\")","v":""},"",null,null,null,null,null,null,""]
[null,null,"|Ω| =",null,null,null,{"$f":"COUNTIF(G69:G117,\">0\")","v":8}]
[]
[null,"Anzahl (Zahl, Farbe):"]
[]
[null,null,1,null,null,"rot",{"$f":"COUNTIF(Kugeln!$X$4:$X$52,CONCATENATE(\"(\",Ergebnismenge!C92,\", \",F122,\")\"))","v":0},null,null,null,null,null,null,null,{"$f":"IF(G122>0,CONCATENATE(\"(\",F122,\", \",C122,\")\"),\"\")","v":""},null,null,null,null,null,null,""]
[null,null,2,null,null,"rot",{"$f":"COUNTIF(Kugeln!$X$4:$X$52,CONCATENATE(\"(\",Ergebnismenge!C93,\", \",F123,\")\"))","v":1},null,null,null,null,null,null,{"$f":"IF(AND(SUM($G$122:G122)>0,G123>0),\", \",\"\")","v":""},"(rot, 2)",null,null,null,null,null,null,"(rot, 2)"]
[null,null,3,null,null,"rot",{"$f":"COUNTIF(Kugeln!$X$4:$X$52,CONCATENATE(\"(\",Ergebnismenge!C94,\", \",F124,\")\"))","v":0},null,null,null,null,null,null,{"$f":"IF(AND(SUM($G$122:G123)>0,G124>0),\", \",\"\")","v":""},{"$f":"IF(G124>0,CONCATENATE(\"(\",F124,\", \",C124,\")\"),\"\")","v":""},null,null,null,null,null,null,""]
[null,null,4,null,null,"rot",{"$f":"COUNTIF(Kugeln!$X$4:$X$52,CONCATENATE(\"(\",Ergebnismenge!C95,\", \",F125,\")\"))","v":1},null,null,null,null,null,null,{"$f":"IF(AND(SUM($G$122:G124)>0,G125>0),\", \",\"\")","v":", "},{"$f":"IF(G125>0,CONCATENATE(\"(\",F125,\", \",C125,\")\"),\"\")","v":"(rot, 4)"},null,null,null,null,null,null,", (rot, 4)"]
[null,null,5,null,null,"rot",{"$f":"COUNTIF(Kugeln!$X$4:$X$52,CONCATENATE(\"(\",Ergebnismenge!C96,\", \",F126,\")\"))","v":0},null,null,null,null,null,null,{"$f":"IF(AND(SUM($G$122:G125)>0,G126>0),\", \",\"\")","v":""},"",null,null,null,null,null,null,""]
[null,null,6,null,null,"rot",{"$f":"COUNTIF(Kugeln!$X$4:$X$52,CONCATENATE(\"(\",Ergebnismenge!C97,\", \",F127,\")\"))","v":2},null,null,null,null,null,null,{"$f":"IF(AND(SUM($G$122:G126)>0,G127>0),\", \",\"\")","v":", "},"(rot, 6)",null,null,null,null,null,null,{"$f":"CONCATENATE(N127,O127)","v":", (rot, 6)"}]
[null,null,7,null,null,"rot",{"$f":"COUNTIF(Kugeln!$X$4:$X$52,CONCATENATE(\"(\",Ergebnismenge!C98,\", \",F128,\")\"))","v":1},null,null,null,null,null,null,{"$f":"IF(AND(SUM($G$122:G127)>0,G128>0),\", \",\"\")","v":", "},"(rot, 7)",null,null,null,null,null,null,", (rot, 7)"]
[null,null,8,null,null,"rot",{"$f":"COUNTIF(Kugeln!$X$4:$X$52,CONCATENATE(\"(\",Ergebnismenge!C99,\", \",F129,\")\"))","v":1},null,null,null,null,null,null,{"$f":"IF(AND(SUM($G$122:G128)>0,G129>0),\", \",\"\")","v":", "},"(rot, 8)",null,null,null,null,null,null,", (rot, 8)"]
[null,null,9,null,null,"rot",{"$f":"COUNTIF(Kugeln!$X$4:$X$52,CONCATENATE(\"(\",Ergebnismenge!C100,\", \",F130,\")\"))","v":0},null,null,null,null,null,null,{"$f":"IF(AND(SUM($G$122:G129)>0,G130>0),\", \",\"\")","v":""},"",null,null,null,null,null,null,""]
[null,null,10,null,null,"rot",{"$f":"COUNTIF(Kugeln!$X$4:$X$52,CONCATENATE(\"(\",Ergebnismenge!C101,\", \",F131,\")\"))","v":0},null,null,null,null,null,null,{"$f":"IF(AND(SUM($G$122:G130)>0,G131>0),\", \",\"\")","v":""},"",null,null,null,null,null,null,""]
[null,null,11,null,null,"rot",{"$f":"COUNTIF(Kugeln!$X$4:$X$52,CONCATENATE(\"(\",Ergebnismenge!C102,\", \",F132,\")\"))","v":0},null,null,null,null,null,null,{"$f":"IF(AND(SUM($G$122:G131)>0,G132>0),\", \",\"\")","v":""},"",null,null,null,null,null,null,""]
[null,null,12,null,null,"rot",{"$f":"COUNTIF(Kugeln!$X$4:$X$52,CONCATENATE(\"(\",Ergebnismenge!C103,\", \",F133,\")\"))","v":0},null,null,null,null,null,null,{"$f":"IF(AND(SUM($G$122:G132)>0,G133>0),\", \",\"\")","v":""},"",null,null,null,null,null,null,""]
[null,null,13,null,null,"rot",{"$f":"COUNTIF(Kugeln!$X$4:$X$52,CONCATENATE(\"(\",Ergebnismenge!C104,\", \",F134,\")\"))","v":0},null,null,null,null,null,null,{"$f":"IF(AND(SUM($G$122:G133)>0,G134>0),\", \",\"\")","v":""},"",null,null,null,null,null,null,""]
[null,null,14,null,null,"rot",{"$f":"COUNTIF(Kugeln!$X$4:$X$52,CONCATENATE(\"(\",Ergebnismenge!C105,\", \",F135,\")\"))","v":0},null,null,null,null,null,null,{"$f":"IF(AND(SUM($G$122:G134)>0,G135>0),\", \",\"\")","v":""},"",null,null,null,null,null,null,""]
[null,null,15,null,null,"rot",{"$f":"COUNTIF(Kugeln!$X$4:$X$52,CONCATENATE(\"(\",Ergebnismenge!C106,\", \",F136,\")\"))","v":0},null,null,null,null,null,null,{"$f":"IF(AND(SUM($G$122:G135)>0,G136>0),\", \",\"\")","v":""},"",null,null,null,null,null,null,""]
[null,null,16,null,null,"rot",{"$f":"COUNTIF(Kugeln!$X$4:$X$52,CONCATENATE(\"(\",Ergebnismenge!C107,\", \",F137,\")\"))","v":0},null,null,null,null,null,null,{"$f":"IF(AND(SUM($G$122:G136)>0,G137>0),\", \",\"\")","v":""},"",null,null,null,null,null,null,""]
[null,null,17,null,null,"rot",{"$f":"COUNTIF(Kugeln!$X$4:$X$52,CONCATENATE(\"(\",Ergebnismenge!C108,\", \",F138,\")\"))","v":0},null,null,null,null,null,null,{"$f":"IF(AND(SUM($G$122:G137)>0,G138>0),\", \",\"\")","v":""},"",null,null,null,null,null,null,""]
[null,null,18,null,null,"rot",{"$f":"COUNTIF(Kugeln!$X$4:$X$52,CONCATENATE(\"(\",Ergebnismenge!C109,\", \",F139,\")\"))","v":0},null,null,null,null,null,null,{"$f":"IF(AND(SUM($G$122:G138)>0,G139>0),\", \",\"\")","v":""},"",null,null,null,null,null,null,""]
[null,null,19,null,null,"rot",{"$f":"COUNTIF(Kugeln!$X$4:$X$52,CONCATENATE(\"(\",Ergebnismenge!C110,\", \",F140,\")\"))","v":0},null,null,null,null,null,null,{"$f":"IF(AND(SUM($G$122:G139)>0,G140>0),\", \",\"\")","v":""},"",null,null,null,null,null,null,""]
[null,null,20,null,null,"rot",{"$f":"COUNTIF(Kugeln!$X$4:$X$52,CONCATENATE(\"(\",Ergebnismenge!C111,\", \",F141,\")\"))","v":0},null,null,null,null,null,null,{"$f":"IF(AND(SUM($G$122:G140)>0,G141>0),\", \",\"\")","v":""},"",null,null,null,null,null,null,""]
[null,null,21,null,null,"rot",{"$f":"COUNTIF(Kugeln!$X$4:$X$52,CONCATENATE(\"(\",Ergebnismenge!C112,\", \",F142,\")\"))","v":0},null,null,null,null,null,null,{"$f":"IF(AND(SUM($G$122:G141)>0,G142>0),\", \",\"\")","v":""},"",null,null,null,null,null,null,""]
[null,null,22,null,null,"rot",{"$f":"COUNTIF(Kugeln!$X$4:$X$52,CONCATENATE(\"(\",Ergebnismenge!C113,\", \",F143,\")\"))","v":0},null,null,null,null,null,null,{"$f":"IF(AND(SUM($G$122:G142)>0,G143>0),\", \",\"\")","v":""},"",null,null,null,null,null,null,""]
[null,null,23,null,null,"rot",{"$f":"COUNTIF(Kugeln!$X$4:$X$52,CONCATENATE(\"(\",Ergebnismenge!C114,\", \",F144,\")\"))","v":0},null,null,null,null,null,null,{"$f":"IF(AND(SUM($G$122:G143)>0,G144>0),\", \",\"\")","v":""},"",null,null,null,null,null,null,""]
[null,null,24,null,null,"rot",{"$f":"COUNTIF(Kugeln!$X$4:$X$52,CONCATENATE(\"(\",Ergebnismenge!C115,\", \",F145,\")\"))","v":0},null,null,null,null,null,null,{"$f":"IF(AND(SUM($G$122:G144)>0,G145>0),\", \",\"\")","v":""},"",null,null,null,null,null,null,""]
[null,null,25,null,null,"rot",{"$f":"COUNTIF(Kugeln!$X$4:$X$52,CONCATENATE(\"(\",Ergebnismenge!C116,\", \",F146,\")\"))","v":0},null,null,null,null,null,null,{"$f":"IF(AND(SUM($G$122:G145)>0,G146>0),\", \",\"\")","v":""},"",null,null,null,null,null,null,""]
[null,null,26,null,null,"rot",{"$f":"COUNTIF(Kugeln!$X$4:$X$52,CONCATENATE(\"(\",Ergebnismenge!C117,\", \",F147,\")\"))","v":0},null,null,null,null,null,null,{"$f":"IF(AND(SUM($G$122:G146)>0,G147>0),\", \",\"\")","v":""},"",null,null,null,null,null,null,""]
[null,null,27,null,null,"rot",{"$f":"COUNTIF(Kugeln!$X$4:$X$52,CONCATENATE(\"(\",Ergebnismenge!C118,\", \",F148,\")\"))","v":0},null,null,null,null,null,null,{"$f":"IF(AND(SUM($G$122:G147)>0,G148>0),\", \",\"\")","v":""},"",null,null,null,null,null,null,""]
[null,null,28,null,null,"rot",{"$f":"COUNTIF(Kugeln!$X$4:$X$52,CONCATENATE(\"(\",Ergebnismenge!C119,\", \",F149,\")\"))","v":0},null,null,null,null,null,null,{"$f":"IF(AND(SUM($G$122:G148)>0,G149>0),\", \",\"\")","v":""},"",null,null,null,null,null,null,""]
[null,null,29,null,null,"rot",{"$f":"COUNTIF(Kugeln!$X$4:$X$52,CONCATENATE(\"(\",Ergebnismenge!C120,\", \",F150,\")\"))","v":0},null,null,null,null,null,null,{"$f":"IF(AND(SUM($G$122:G149)>0,G150>0),\", \",\"\")","v":""},"",null,null,null,null,null,null,""]
[null,null,30,null,null,"rot",{"$f":"COUNTIF(Kugeln!$X$4:$X$52,CONCATENATE(\"(\",Ergebnismenge!C121,\", \",F151,\")\"))","v":0},null,null,null,null,null,null,{"$f":"IF(AND(SUM($G$122:G150)>0,G151>0),\", \",\"\")","v":""},"",null,null,null,null,null,null,""]
[null,null,31,null,null,"rot",{"$f":"COUNTIF(Kugeln!$X$4:$X$52,CONCATENATE(\"(\",Ergebnismenge!C122,\", \",F152,\")\"))","v":0},null,null,null,null,null,null,{"$f":"IF(AND(SUM($G$122:G151)>0,G152>0),\", \",\"\")","v":""},"",null,null,null,null,null,null,""]
[null,null,32,null,null,"rot",{"$f":"COUNTIF(Kugeln!$X$4:$X$52,CONCATENATE(\"(\",Ergebnismenge!C123,\", \",F153,\")\"))","v":0},null,null,null,null,null,null,{"$f":"IF(AND(SUM($G$122:G152)>0,G153>0),\", \",\"\")","v":""},"",null,null,null,null,null,null,""]
[null,null,33,null,null,"rot",{"$f":"COUNTIF(Kugeln!$X$4:$X$52,CONCATENATE(\"(\",Ergebnismenge!C124,\", \",F154,\")\"))","v":0},null,null,null,null,null,null,{"$f":"IF(AND(SUM($G$122:G153)>0,G154>0),\", \",\"\")","v":""},"",null,null,null,null,null,null,""]
[null,null,34,null,null,"rot",{"$f":"COUNTIF(Kugeln!$X$4:$X$52,CONCATENATE(\"(\",Ergebnismenge!C125,\", \",F155,\")\"))","v":0},null,null,null,null,null,null,{"$f":"IF(AND(SUM($G$122:G154)>0,G155>0),\", \",\"\")","v":""},"",null,null,null,null,null,null,""]
[null,null,35,null,null,"rot",{"$f":"COUNTIF(Kugeln!$X$4:$X$52,CONCATENATE(\"(\",Ergebnismenge!C126,\", \",F156,\")\"))","v":0},null,null,null,null,null,null,{"$f":"IF(AND(SUM($G$122:G155)>0,G156>0),\", \",\"\")","v":""},"",null,null,null,null,null,null,""]
[null,null,36,null,null,"rot",{"$f":"COUNTIF(Kugeln!$X$4:$X$52,CONCATENATE(\"(\",Ergebnismenge!C127,\", \",F157,\")\"))","v":0},null,null,null,null,null,null,{"$f":"IF(AND(SUM($G$122:G156)>0,G157>0),\", \",\"\")","v":""},"",null,null,null,null,null,null,""]
[null,null,37,null,null,"rot",{"$f":"COUNTIF(Kugeln!$X$4:$X$52,CONCATENATE(\"(\",Ergebnismenge!C128,\", \",F158,\")\"))","v":0},null,null,null,null,null,null,{"$f":"IF(AND(SUM($G$122:G157)>0,G158>0),\", \",\"\")","v":""},"",null,null,null,null,null,null,""]
[null,null,38,null,null,"rot",{"$f":"COUNTIF(Kugeln!$X$4:$X$52,CONCATENATE(\"(\",Ergebnismenge!C129,\", \",F159,\")\"))","v":0},null,null,null,null,null,null,{"$f":"IF(AND(SUM($G$122:G158)>0,G159>0),\", \",\"\")","v":""},"",null,null,null,null,null,null,""]
[null,null,39,null,null,"rot",{"$f":"COUNTIF(Kugeln!$X$4:$X$52,CONCATENATE(\"(\",Ergebnismenge!C130,\", \",F160,\")\"))","v":0},null,null,null,null,null,null,{"$f":"IF(AND(SUM($G$122:G159)>0,G160>0),\", \",\"\")","v":""},"",null,null,null,null,null,null,""]
[null,null,40,null,null,"rot",{"$f":"COUNTIF(Kugeln!$X$4:$X$52,CONCATENATE(\"(\",Ergebnismenge!C131,\", \",F161,\")\"))","v":0},null,null,null,null,null,null,{"$f":"IF(AND(SUM($G$122:G160)>0,G161>0),\", \",\"\")","v":""},"",null,null,null,null,null,null,""]
[null,null,41,null,null,"rot",{"$f":"COUNTIF(Kugeln!$X$4:$X$52,CONCATENATE(\"(\",Ergebnismenge!C132,\", \",F162,\")\"))","v":0},null,null,null,null,null,null,{"$f":"IF(AND(SUM($G$122:G161)>0,G162>0),\", \",\"\")","v":""},"",null,null,null,null,null,null,""]
[null,null,42,null,null,"rot",{"$f":"COUNTIF(Kugeln!$X$4:$X$52,CONCATENATE(\"(\",Ergebnismenge!C133,\", \",F163,\")\"))","v":0},null,null,null,null,null,null,{"$f":"IF(AND(SUM($G$122:G162)>0,G163>0),\", \",\"\")","v":""},"",null,null,null,null,null,null,""]
[null,null,43,null,null,"rot",{"$f":"COUNTIF(Kugeln!$X$4:$X$52,CONCATENATE(\"(\",Ergebnismenge!C134,\", \",F164,\")\"))","v":0},null,null,null,null,null,null,{"$f":"IF(AND(SUM($G$122:G163)>0,G164>0),\", \",\"\")","v":""},"",null,null,null,null,null,null,""]
[null,null,44,null,null,"rot",{"$f":"COUNTIF(Kugeln!$X$4:$X$52,CONCATENATE(\"(\",Ergebnismenge!C135,\", \",F165,\")\"))","v":0},null,null,null,null,null,null,{"$f":"IF(AND(SUM($G$122:G164)>0,G165>0),\", \",\"\")","v":""},"",null,null,null,null,null,null,""]
[null,null,45,null,null,"rot",{"$f":"COUNTIF(Kugeln!$X$4:$X$52,CONCATENATE(\"(\",Ergebnismenge!C136,\", \",F166,\")\"))","v":0},null,null,null,null,null,null,{"$f":"IF(AND(SUM($G$122:G165)>0,G166>0),\", \",\"\")","v":""},"",null,null,null,null,null,null,""]
[null,null,46,null,null,"rot",{"$f":"COUNTIF(Kugeln!$X$4:$X$52,CONCATENATE(\"(\",Ergebnismenge!C137,\", \",F167,\")\"))","v":0},null,null,null,null,null,null,{"$f":"IF(AND(SUM($G$122:G166)>0,G167>0),\", \",\"\")","v":""},"",null,null,null,null,null,null,""]
[null,null,47,null,null,"rot",{"$f":"COUNTIF(Kugeln!$X$4:$X$52,CONCATENATE(\"(\",Ergebnismenge!C138,\", \",F168,\")\"))","v":0},null,null,null,null,null,null,{"$f":"IF(AND(SUM($G$122:G167)>0,G168>0),\", \",\"\")","v":""},"",null,null,null,null,null,null,""]
[null,null,48,null,null,"rot",{"$f":"COUNTIF(Kugeln!$X$4:$X$52,CONCATENATE(\"(\",Ergebnismenge!C139,\", \",F169,\")\"))","v":0},null,null,null,null,null,null,{"$f":"IF(AND(SUM($G$122:G168)>0,G169>0),\", \",\"\")","v":""},"",null,null,null,null,null,null,""]
[null,null,49,null,null,"rot",{"$f":"COUNTIF(Kugeln!$X$4:$X$52,CONCATENATE(\"(\",Ergebnismenge!C140,\", \",F170,\")\"))","v":0},null,null,null,null,null,null,{"$f":"IF(AND(SUM($G$122:G169)>0,G170>0),\", \",\"\")","v":""},"",null,null,null,null,null,null,""]
[null,null,1,null,null,"grün",{"$f":"COUNTIF(Kugeln!$X$4:$X$52,CONCATENATE(\"(\",Ergebnismenge!C141,\", \",F171,\")\"))","v":0},null,null,null,null,null,null,{"$f":"IF(AND(SUM($G$122:G170)>0,G171>0),\", \",\"\")","v":""},"",null,null,null,null,null,null,""]
[null,null,2,null,null,"grün",{"$f":"COUNTIF(Kugeln!$X$4:$X$52,CONCATENATE(\"(\",Ergebnismenge!C142,\", \",F172,\")\"))","v":2},null,null,null,null,null,null,{"$f":"IF(AND(SUM($G$122:G171)>0,G172>0),\", \",\"\")","v":", "},"(grün, 2)",null,null,null,null,null,null,", (grün, 2)"]
[null,null,3,null,null,"grün",{"$f":"COUNTIF(Kugeln!$X$4:$X$52,CONCATENATE(\"(\",Ergebnismenge!C143,\", \",F173,\")\"))","v":1},null,null,null,null,null,null,{"$f":"IF(AND(SUM($G$122:G172)>0,G173>0),\", \",\"\")","v":", "},"(grün, 3)",null,null,null,null,null,null,", (grün, 3)"]
[null,null,4,null,null,"grün",{"$f":"COUNTIF(Kugeln!$X$4:$X$52,CONCATENATE(\"(\",Ergebnismenge!C144,\", \",F174,\")\"))","v":2},null,null,null,null,null,null,{"$f":"IF(AND(SUM($G$122:G173)>0,G174>0),\", \",\"\")","v":", "},"(grün, 4)",null,null,null,null,null,null,", (grün, 4)"]
[null,null,5,null,null,"grün",{"$f":"COUNTIF(Kugeln!$X$4:$X$52,CONCATENATE(\"(\",Ergebnismenge!C145,\", \",F175,\")\"))","v":1},null,null,null,null,null,null,{"$f":"IF(AND(SUM($G$122:G174)>0,G175>0),\", \",\"\")","v":", "},"(grün, 5)",null,null,null,null,null,null,", (grün, 5)"]
[null,null,6,null,null,"grün",{"$f":"COUNTIF(Kugeln!$X$4:$X$52,CONCATENATE(\"(\",Ergebnismenge!C146,\", \",F176,\")\"))","v":2},null,null,null,null,null,null,{"$f":"IF(AND(SUM($G$122:G175)>0,G176>0),\", \",\"\")","v":", "},"(grün, 6)",null,null,null,null,null,null,", (grün, 6)"]
[null,null,7,null,null,"grün",{"$f":"COUNTIF(Kugeln!$X$4:$X$52,CONCATENATE(\"(\",Ergebnismenge!C147,\", \",F177,\")\"))","v":2},null,null,null,null,null,null,{"$f":"IF(AND(SUM($G$122:G176)>0,G177>0),\", \",\"\")","v":", "},"(grün, 7)",null,null,null,null,null,null,", (grün, 7)"]
[null,null,8,null,null,"grün",{"$f":"COUNTIF(Kugeln!$X$4:$X$52,CONCATENATE(\"(\",Ergebnismenge!C148,\", \",F178,\")\"))","v":3},null,null,null,null,null,null,{"$f":"IF(AND(SUM($G$122:G177)>0,G178>0),\", \",\"\")","v":", "},"(grün, 8)",null,null,null,null,null,null,", (grün, 8)"]
[null,null,9,null,null,"grün",{"$f":"COUNTIF(Kugeln!$X$4:$X$52,CONCATENATE(\"(\",Ergebnismenge!C149,\", \",F179,\")\"))","v":2},null,null,null,null,null,null,{"$f":"IF(AND(SUM($G$122:G178)>0,G179>0),\", \",\"\")","v":", "},"(grün, 9)",null,null,null,null,null,null,", (grün, 9)"]
[null,null,10,null,null,"grün",{"$f":"COUNTIF(Kugeln!$X$4:$X$52,CONCATENATE(\"(\",Ergebnismenge!C150,\", \",F180,\")\"))","v":0},null,null,null,null,null,null,{"$f":"IF(AND(SUM($G$122:G179)>0,G180>0),\", \",\"\")","v":""},"",null,null,null,null,null,null,""]
[null,null,11,null,null,"grün",{"$f":"COUNTIF(Kugeln!$X$4:$X$52,CONCATENATE(\"(\",Ergebnismenge!C151,\", \",F181,\")\"))","v":0},null,null,null,null,null,null,{"$f":"IF(AND(SUM($G$122:G180)>0,G181>0),\", \",\"\")","v":""},"",null,null,null,null,null,null,""]
[null,null,12,null,null,"grün",{"$f":"COUNTIF(Kugeln!$X$4:$X$52,CONCATENATE(\"(\",Ergebnismenge!C152,\", \",F182,\")\"))","v":0},null,null,null,null,null,null,{"$f":"IF(AND(SUM($G$122:G181)>0,G182>0),\", \",\"\")","v":""},"",null,null,null,null,null,null,""]
[null,null,13,null,null,"grün",{"$f":"COUNTIF(Kugeln!$X$4:$X$52,CONCATENATE(\"(\",Ergebnismenge!C153,\", \",F183,\")\"))","v":0},null,null,null,null,null,null,{"$f":"IF(AND(SUM($G$122:G182)>0,G183>0),\", \",\"\")","v":""},"",null,null,null,null,null,null,""]
[null,null,14,null,null,"grün",{"$f":"COUNTIF(Kugeln!$X$4:$X$52,CONCATENATE(\"(\",Ergebnismenge!C154,\", \",F184,\")\"))","v":0},null,null,null,null,null,null,{"$f":"IF(AND(SUM($G$122:G183)>0,G184>0),\", \",\"\")","v":""},"",null,null,null,null,null,null,""]
[null,null,15,null,null,"grün",{"$f":"COUNTIF(Kugeln!$X$4:$X$52,CONCATENATE(\"(\",Ergebnismenge!C155,\", \",F185,\")\"))","v":0},null,null,null,null,null,null,{"$f":"IF(AND(SUM($G$122:G184)>0,G185>0),\", \",\"\")","v":""},"",null,null,null,null,null,null,""]
[null,null,16,null,null,"grün",{"$f":"COUNTIF(Kugeln!$X$4:$X$52,CONCATENATE(\"(\",Ergebnismenge!C156,\", \",F186,\")\"))","v":0},null,null,null,null,null,null,{"$f":"IF(AND(SUM($G$122:G185)>0,G186>0),\", \",\"\")","v":""},"",null,null,null,null,null,null,""]
[null,null,17,null,null,"grün",{"$f":"COUNTIF(Kugeln!$X$4:$X$52,CONCATENATE(\"(\",Ergebnismenge!C157,\", \",F187,\")\"))","v":0},null,null,null,null,null,null,{"$f":"IF(AND(SUM($G$122:G186)>0,G187>0),\", \",\"\")","v":""},"",null,null,null,null,null,null,""]
[null,null,18,null,null,"grün",{"$f":"COUNTIF(Kugeln!$X$4:$X$52,CONCATENATE(\"(\",Ergebnismenge!C158,\", \",F188,\")\"))","v":0},null,null,null,null,null,null,{"$f":"IF(AND(SUM($G$122:G187)>0,G188>0),\", \",\"\")","v":""},"",null,null,null,null,null,null,""]
[null,null,19,null,null,"grün",{"$f":"COUNTIF(Kugeln!$X$4:$X$52,CONCATENATE(\"(\",Ergebnismenge!C159,\", \",F189,\")\"))","v":0},null,null,null,null,null,null,{"$f":"IF(AND(SUM($G$122:G188)>0,G189>0),\", \",\"\")","v":""},{"$f":"IF(G189>0,CONCATENATE(\"(\",F189,\", \",C189,\")\"),\"\")","v":""},null,null,null,null,null,null,""]
[null,null,20,null,null,"grün",{"$f":"COUNTIF(Kugeln!$X$4:$X$52,CONCATENATE(\"(\",Ergebnismenge!C160,\", \",F190,\")\"))","v":0},null,null,null,null,null,null,{"$f":"IF(AND(SUM($G$122:G189)>0,G190>0),\", \",\"\")","v":""},"",null,null,null,null,null,null,""]
[null,null,21,null,null,"grün",{"$f":"COUNTIF(Kugeln!$X$4:$X$52,CONCATENATE(\"(\",Ergebnismenge!C161,\", \",F191,\")\"))","v":0},null,null,null,null,null,null,{"$f":"IF(AND(SUM($G$122:G190)>0,G191>0),\", \",\"\")","v":""},"",null,null,null,null,null,null,{"$f":"CONCATENATE(N191,O191)","v":""}]
[null,null,22,null,null,"grün",{"$f":"COUNTIF(Kugeln!$X$4:$X$52,CONCATENATE(\"(\",Ergebnismenge!C162,\", \",F192,\")\"))","v":0},null,null,null,null,null,null,{"$f":"IF(AND(SUM($G$122:G191)>0,G192>0),\", \",\"\")","v":""},"",null,null,null,null,null,null,""]
[null,null,23,null,null,"grün",{"$f":"COUNTIF(Kugeln!$X$4:$X$52,CONCATENATE(\"(\",Ergebnismenge!C163,\", \",F193,\")\"))","v":0},null,null,null,null,null,null,{"$f":"IF(AND(SUM($G$122:G192)>0,G193>0),\", \",\"\")","v":""},"",null,null,null,null,null,null,""]
[null,null,24,null,null,"grün",{"$f":"COUNTIF(Kugeln!$X$4:$X$52,CONCATENATE(\"(\",Ergebnismenge!C164,\", \",F194,\")\"))","v":0},null,null,null,null,null,null,{"$f":"IF(AND(SUM($G$122:G193)>0,G194>0),\", \",\"\")","v":""},"",null,null,null,null,null,null,""]
[null,null,25,null,null,"grün",{"$f":"COUNTIF(Kugeln!$X$4:$X$52,CONCATENATE(\"(\",Ergebnismenge!C165,\", \",F195,\")\"))","v":0},null,null,null,null,null,null,{"$f":"IF(AND(SUM($G$122:G194)>0,G195>0),\", \",\"\")","v":""},"",null,null,null,null,null,null,""]
[null,null,26,null,null,"grün",{"$f":"COUNTIF(Kugeln!$X$4:$X$52,CONCATENATE(\"(\",Ergebnismenge!C166,\", \",F196,\")\"))","v":0},null,null,null,null,null,null,{"$f":"IF(AND(SUM($G$122:G195)>0,G196>0),\", \",\"\")","v":""},"",null,null,null,null,null,null,""]
[null,null,27,null,null,"grün",{"$f":"COUNTIF(Kugeln!$X$4:$X$52,CONCATENATE(\"(\",Ergebnismenge!C167,\", \",F197,\")\"))","v":0},null,null,null,null,null,null,{"$f":"IF(AND(SUM($G$122:G196)>0,G197>0),\", \",\"\")","v":""},"",null,null,null,null,null,null,""]
[null,null,28,null,null,"grün",{"$f":"COUNTIF(Kugeln!$X$4:$X$52,CONCATENATE(\"(\",Ergebnismenge!C168,\", \",F198,\")\"))","v":0},null,null,null,null,null,null,{"$f":"IF(AND(SUM($G$122:G197)>0,G198>0),\", \",\"\")","v":""},"",null,null,null,null,null,null,""]
[null,null,29,null,null,"grün",{"$f":"COUNTIF(Kugeln!$X$4:$X$52,CONCATENATE(\"(\",Ergebnismenge!C169,\", \",F199,\")\"))","v":0},null,null,null,null,null,null,{"$f":"IF(AND(SUM($G$122:G198)>0,G199>0),\", \",\"\")","v":""},"",null,null,null,null,null,null,""]
[null,null,30,null,null,"grün",{"$f":"COUNTIF(Kugeln!$X$4:$X$52,CONCATENATE(\"(\",Ergebnismenge!C170,\", \",F200,\")\"))","v":0},null,null,null,null,null,null,{"$f":"IF(AND(SUM($G$122:G199)>0,G200>0),\", \",\"\")","v":""},"",null,null,null,null,null,null,""]
[null,null,31,null,null,"grün",{"$f":"COUNTIF(Kugeln!$X$4:$X$52,CONCATENATE(\"(\",Ergebnismenge!C171,\", \",F201,\")\"))","v":0},null,null,null,null,null,null,{"$f":"IF(AND(SUM($G$122:G200)>0,G201>0),\", \",\"\")","v":""},"",null,null,null,null,null,null,""]
[null,null,32,null,null,"grün",{"$f":"COUNTIF(Kugeln!$X$4:$X$52,CONCATENATE(\"(\",Ergebnismenge!C172,\", \",F202,\")\"))","v":0},null,null,null,null,null,null,{"$f":"IF(AND(SUM($G$122:G201)>0,G202>0),\", \",\"\")","v":""},"",null,null,null,null,null,null,""]
[null,null,33,null,null,"grün",{"$f":"COUNTIF(Kugeln!$X$4:$X$52,CONCATENATE(\"(\",Ergebnismenge!C173,\", \",F203,\")\"))","v":0},null,null,null,null,null,null,{"$f":"IF(AND(SUM($G$122:G202)>0,G203>0),\", \",\"\")","v":""},"",null,null,null,null,null,null,""]
[null,null,34,null,null,"grün",{"$f":"COUNTIF(Kugeln!$X$4:$X$52,CONCATENATE(\"(\",Ergebnismenge!C174,\", \",F204,\")\"))","v":0},null,null,null,null,null,null,{"$f":"IF(AND(SUM($G$122:G203)>0,G204>0),\", \",\"\")","v":""},"",null,null,null,null,null,null,""]
[null,null,35,null,null,"grün",{"$f":"COUNTIF(Kugeln!$X$4:$X$52,CONCATENATE(\"(\",Ergebnismenge!C175,\", \",F205,\")\"))","v":0},null,null,null,null,null,null,{"$f":"IF(AND(SUM($G$122:G204)>0,G205>0),\", \",\"\")","v":""},"",null,null,null,null,null,null,""]
[null,null,36,null,null,"grün",{"$f":"COUNTIF(Kugeln!$X$4:$X$52,CONCATENATE(\"(\",Ergebnismenge!C176,\", \",F206,\")\"))","v":0},null,null,null,null,null,null,{"$f":"IF(AND(SUM($G$122:G205)>0,G206>0),\", \",\"\")","v":""},"",null,null,null,null,null,null,""]
[null,null,37,null,null,"grün",{"$f":"COUNTIF(Kugeln!$X$4:$X$52,CONCATENATE(\"(\",Ergebnismenge!C177,\", \",F207,\")\"))","v":0},null,null,null,null,null,null,{"$f":"IF(AND(SUM($G$122:G206)>0,G207>0),\", \",\"\")","v":""},"",null,null,null,null,null,null,""]
[null,null,38,null,null,"grün",{"$f":"COUNTIF(Kugeln!$X$4:$X$52,CONCATENATE(\"(\",Ergebnismenge!C178,\", \",F208,\")\"))","v":0},null,null,null,null,null,null,{"$f":"IF(AND(SUM($G$122:G207)>0,G208>0),\", \",\"\")","v":""},"",null,null,null,null,null,null,""]
[null,null,39,null,null,"grün",{"$f":"COUNTIF(Kugeln!$X$4:$X$52,CONCATENATE(\"(\",Ergebnismenge!C179,\", \",F209,\")\"))","v":0},null,null,null,null,null,null,{"$f":"IF(AND(SUM($G$122:G208)>0,G209>0),\", \",\"\")","v":""},"",null,null,null,null,null,null,""]
[null,null,40,null,null,"grün",{"$f":"COUNTIF(Kugeln!$X$4:$X$52,CONCATENATE(\"(\",Ergebnismenge!C180,\", \",F210,\")\"))","v":0},null,null,null,null,null,null,{"$f":"IF(AND(SUM($G$122:G209)>0,G210>0),\", \",\"\")","v":""},"",null,null,null,null,null,null,""]
[null,null,41,null,null,"grün",{"$f":"COUNTIF(Kugeln!$X$4:$X$52,CONCATENATE(\"(\",Ergebnismenge!C181,\", \",F211,\")\"))","v":0},null,null,null,null,null,null,{"$f":"IF(AND(SUM($G$122:G210)>0,G211>0),\", \",\"\")","v":""},"",null,null,null,null,null,null,""]
[null,null,42,null,null,"grün",{"$f":"COUNTIF(Kugeln!$X$4:$X$52,CONCATENATE(\"(\",Ergebnismenge!C182,\", \",F212,\")\"))","v":0},null,null,null,null,null,null,{"$f":"IF(AND(SUM($G$122:G211)>0,G212>0),\", \",\"\")","v":""},"",null,null,null,null,null,null,""]
[null,null,43,null,null,"grün",{"$f":"COUNTIF(Kugeln!$X$4:$X$52,CONCATENATE(\"(\",Ergebnismenge!C183,\", \",F213,\")\"))","v":0},null,null,null,null,null,null,{"$f":"IF(AND(SUM($G$122:G212)>0,G213>0),\", \",\"\")","v":""},"",null,null,null,null,null,null,""]
[null,null,44,null,null,"grün",{"$f":"COUNTIF(Kugeln!$X$4:$X$52,CONCATENATE(\"(\",Ergebnismenge!C184,\", \",F214,\")\"))","v":0},null,null,null,null,null,null,{"$f":"IF(AND(SUM($G$122:G213)>0,G214>0),\", \",\"\")","v":""},"",null,null,null,null,null,null,""]
[null,null,45,null,null,"grün",{"$f":"COUNTIF(Kugeln!$X$4:$X$52,CONCATENATE(\"(\",Ergebnismenge!C185,\", \",F215,\")\"))","v":0},null,null,null,null,null,null,{"$f":"IF(AND(SUM($G$122:G214)>0,G215>0),\", \",\"\")","v":""},"",null,null,null,null,null,null,""]
[null,null,46,null,null,"grün",{"$f":"COUNTIF(Kugeln!$X$4:$X$52,CONCATENATE(\"(\",Ergebnismenge!C186,\", \",F216,\")\"))","v":0},null,null,null,null,null,null,{"$f":"IF(AND(SUM($G$122:G215)>0,G216>0),\", \",\"\")","v":""},"",null,null,null,null,null,null,""]
[null,null,47,null,null,"grün",{"$f":"COUNTIF(Kugeln!$X$4:$X$52,CONCATENATE(\"(\",Ergebnismenge!C187,\", \",F217,\")\"))","v":0},null,null,null,null,null,null,{"$f":"IF(AND(SUM($G$122:G216)>0,G217>0),\", \",\"\")","v":""},"",null,null,null,null,null,null,""]
[null,null,48,null,null,"grün",{"$f":"COUNTIF(Kugeln!$X$4:$X$52,CONCATENATE(\"(\",Ergebnismenge!C188,\", \",F218,\")\"))","v":0},null,null,null,null,null,null,{"$f":"IF(AND(SUM($G$122:G217)>0,G218>0),\", \",\"\")","v":""},"",null,null,null,null,null,null,""]
[null,null,49,null,null,"grün",{"$f":"COUNTIF(Kugeln!$X$4:$X$52,CONCATENATE(\"(\",Ergebnismenge!C189,\", \",F219,\")\"))","v":0},null,null,null,null,null,null,{"$f":"IF(AND(SUM($G$122:G218)>0,G219>0),\", \",\"\")","v":""},"",null,null,null,null,null,null,""]
[null,null,1,null,null,"blau",{"$f":"COUNTIF(Kugeln!$X$4:$X$52,CONCATENATE(\"(\",Ergebnismenge!C190,\", \",F220,\")\"))","v":0},null,null,null,null,null,null,{"$f":"IF(AND(SUM($G$122:G219)>0,G220>0),\", \",\"\")","v":""},"",null,null,null,null,null,null,""]
[null,null,2,null,null,"blau",{"$f":"COUNTIF(Kugeln!$X$4:$X$52,CONCATENATE(\"(\",Ergebnismenge!C191,\", \",F221,\")\"))","v":1},null,null,null,null,null,null,{"$f":"IF(AND(SUM($G$122:G220)>0,G221>0),\", \",\"\")","v":", "},"(blau, 2)",null,null,null,null,null,null,", (blau, 2)"]
[null,null,3,null,null,"blau",{"$f":"COUNTIF(Kugeln!$X$4:$X$52,CONCATENATE(\"(\",Ergebnismenge!C192,\", \",F222,\")\"))","v":0},null,null,null,null,null,null,{"$f":"IF(AND(SUM($G$122:G221)>0,G222>0),\", \",\"\")","v":""},"",null,null,null,null,null,null,""]
[null,null,4,null,null,"blau",{"$f":"COUNTIF(Kugeln!$X$4:$X$52,CONCATENATE(\"(\",Ergebnismenge!C193,\", \",F223,\")\"))","v":0},null,null,null,null,null,null,{"$f":"IF(AND(SUM($G$122:G222)>0,G223>0),\", \",\"\")","v":""},"",null,null,null,null,null,null,""]
[null,null,5,null,null,"blau",{"$f":"COUNTIF(Kugeln!$X$4:$X$52,CONCATENATE(\"(\",Ergebnismenge!C194,\", \",F224,\")\"))","v":2},null,null,null,null,null,null,{"$f":"IF(AND(SUM($G$122:G223)>0,G224>0),\", \",\"\")","v":", "},"(blau, 5)",null,null,null,null,null,null,", (blau, 5)"]
[null,null,6,null,null,"blau",{"$f":"COUNTIF(Kugeln!$X$4:$X$52,CONCATENATE(\"(\",Ergebnismenge!C195,\", \",F225,\")\"))","v":0},null,null,null,null,null,null,{"$f":"IF(AND(SUM($G$122:G224)>0,G225>0),\", \",\"\")","v":""},"",null,null,null,null,null,null,""]
[null,null,7,null,null,"blau",{"$f":"COUNTIF(Kugeln!$X$4:$X$52,CONCATENATE(\"(\",Ergebnismenge!C196,\", \",F226,\")\"))","v":1},null,null,null,null,null,null,{"$f":"IF(AND(SUM($G$122:G225)>0,G226>0),\", \",\"\")","v":", "},"(blau, 7)",null,null,null,null,null,null,", (blau, 7)"]
[null,null,8,null,null,"blau",{"$f":"COUNTIF(Kugeln!$X$4:$X$52,CONCATENATE(\"(\",Ergebnismenge!C197,\", \",F227,\")\"))","v":1},null,null,null,null,null,null,{"$f":"IF(AND(SUM($G$122:G226)>0,G227>0),\", \",\"\")","v":", "},"(blau, 8)",null,null,null,null,null,null,", (blau, 8)"]
[null,null,9,null,null,"blau",{"$f":"COUNTIF(Kugeln!$X$4:$X$52,CONCATENATE(\"(\",Ergebnismenge!C198,\", \",F228,\")\"))","v":2},null,null,null,null,null,null,{"$f":"IF(AND(SUM($G$122:G227)>0,G228>0),\", \",\"\")","v":", "},"(blau, 9)",null,null,null,null,null,null,", (blau, 9)"]
[null,null,10,null,null,"blau",{"$f":"COUNTIF(Kugeln!$X$4:$X$52,CONCATENATE(\"(\",Ergebnismenge!C199,\", \",F229,\")\"))","v":0},null,null,null,null,null,null,{"$f":"IF(AND(SUM($G$122:G228)>0,G229>0),\", \",\"\")","v":""},"",null,null,null,null,null,null,""]
[null,null,11,null,null,"blau",{"$f":"COUNTIF(Kugeln!$X$4:$X$52,CONCATENATE(\"(\",Ergebnismenge!C200,\", \",F230,\")\"))","v":0},null,null,null,null,null,null,{"$f":"IF(AND(SUM($G$122:G229)>0,G230>0),\", \",\"\")","v":""},"",null,null,null,null,null,null,""]
[null,null,12,null,null,"blau",{"$f":"COUNTIF(Kugeln!$X$4:$X$52,CONCATENATE(\"(\",Ergebnismenge!C201,\", \",F231,\")\"))","v":0},null,null,null,null,null,null,{"$f":"IF(AND(SUM($G$122:G230)>0,G231>0),\", \",\"\")","v":""},"",null,null,null,null,null,null,""]
[null,null,13,null,null,"blau",{"$f":"COUNTIF(Kugeln!$X$4:$X$52,CONCATENATE(\"(\",Ergebnismenge!C202,\", \",F232,\")\"))","v":0},null,null,null,null,null,null,{"$f":"IF(AND(SUM($G$122:G231)>0,G232>0),\", \",\"\")","v":""},"",null,null,null,null,null,null,""]
[null,null,14,null,null,"blau",{"$f":"COUNTIF(Kugeln!$X$4:$X$52,CONCATENATE(\"(\",Ergebnismenge!C203,\", \",F233,\")\"))","v":0},null,null,null,null,null,null,{"$f":"IF(AND(SUM($G$122:G232)>0,G233>0),\", \",\"\")","v":""},"",null,null,null,null,null,null,""]
[null,null,15,null,null,"blau",{"$f":"COUNTIF(Kugeln!$X$4:$X$52,CONCATENATE(\"(\",Ergebnismenge!C204,\", \",F234,\")\"))","v":0},null,null,null,null,null,null,{"$f":"IF(AND(SUM($G$122:G233)>0,G234>0),\", \",\"\")","v":""},"",null,null,null,null,null,null,""]
[null,null,16,null,null,"blau",{"$f":"COUNTIF(Kugeln!$X$4:$X$52,CONCATENATE(\"(\",Ergebnismenge!C205,\", \",F235,\")\"))","v":0},null,null,null,null,null,null,{"$f":"IF(AND(SUM($G$122:G234)>0,G235>0),\", \",\"\")","v":""},"",null,null,null,null,null,null,""]
[null,null,17,null,null,"blau",{"$f":"COUNTIF(Kugeln!$X$4:$X$52,CONCATENATE(\"(\",Ergebnismenge!C206,\", \",F236,\")\"))","v":0},null,null,null,null,null,null,{"$f":"IF(AND(SUM($G$122:G235)>0,G236>0),\", \",\"\")","v":""},"",null,null,null,null,null,null,""]
[null,null,18,null,null,"blau",{"$f":"COUNTIF(Kugeln!$X$4:$X$52,CONCATENATE(\"(\",Ergebnismenge!C207,\", \",F237,\")\"))","v":0},null,null,null,null,null,null,{"$f":"IF(AND(SUM($G$122:G236)>0,G237>0),\", \",\"\")","v":""},"",null,null,null,null,null,null,""]
[null,null,19,null,null,"blau",{"$f":"COUNTIF(Kugeln!$X$4:$X$52,CONCATENATE(\"(\",Ergebnismenge!C208,\", \",F238,\")\"))","v":0},null,null,null,null,null,null,{"$f":"IF(AND(SUM($G$122:G237)>0,G238>0),\", \",\"\")","v":""},"",null,null,null,null,null,null,""]
[null,null,20,null,null,"blau",{"$f":"COUNTIF(Kugeln!$X$4:$X$52,CONCATENATE(\"(\",Ergebnismenge!C209,\", \",F239,\")\"))","v":0},null,null,null,null,null,null,{"$f":"IF(AND(SUM($G$122:G238)>0,G239>0),\", \",\"\")","v":""},"",null,null,null,null,null,null,""]
[null,null,21,null,null,"blau",{"$f":"COUNTIF(Kugeln!$X$4:$X$52,CONCATENATE(\"(\",Ergebnismenge!C210,\", \",F240,\")\"))","v":0},null,null,null,null,null,null,{"$f":"IF(AND(SUM($G$122:G239)>0,G240>0),\", \",\"\")","v":""},"",null,null,null,null,null,null,""]
[null,null,22,null,null,"blau",{"$f":"COUNTIF(Kugeln!$X$4:$X$52,CONCATENATE(\"(\",Ergebnismenge!C211,\", \",F241,\")\"))","v":0},null,null,null,null,null,null,{"$f":"IF(AND(SUM($G$122:G240)>0,G241>0),\", \",\"\")","v":""},"",null,null,null,null,null,null,""]
[null,null,23,null,null,"blau",{"$f":"COUNTIF(Kugeln!$X$4:$X$52,CONCATENATE(\"(\",Ergebnismenge!C212,\", \",F242,\")\"))","v":0},null,null,null,null,null,null,{"$f":"IF(AND(SUM($G$122:G241)>0,G242>0),\", \",\"\")","v":""},"",null,null,null,null,null,null,""]
[null,null,24,null,null,"blau",{"$f":"COUNTIF(Kugeln!$X$4:$X$52,CONCATENATE(\"(\",Ergebnismenge!C213,\", \",F243,\")\"))","v":0},null,null,null,null,null,null,{"$f":"IF(AND(SUM($G$122:G242)>0,G243>0),\", \",\"\")","v":""},"",null,null,null,null,null,null,""]
[null,null,25,null,null,"blau",{"$f":"COUNTIF(Kugeln!$X$4:$X$52,CONCATENATE(\"(\",Ergebnismenge!C214,\", \",F244,\")\"))","v":0},null,null,null,null,null,null,{"$f":"IF(AND(SUM($G$122:G243)>0,G244>0),\", \",\"\")","v":""},"",null,null,null,null,null,null,""]
[null,null,26,null,null,"blau",{"$f":"COUNTIF(Kugeln!$X$4:$X$52,CONCATENATE(\"(\",Ergebnismenge!C215,\", \",F245,\")\"))","v":0},null,null,null,null,null,null,{"$f":"IF(AND(SUM($G$122:G244)>0,G245>0),\", \",\"\")","v":""},"",null,null,null,null,null,null,""]
[null,null,27,null,null,"blau",{"$f":"COUNTIF(Kugeln!$X$4:$X$52,CONCATENATE(\"(\",Ergebnismenge!C216,\", \",F246,\")\"))","v":0},null,null,null,null,null,null,{"$f":"IF(AND(SUM($G$122:G245)>0,G246>0),\", \",\"\")","v":""},"",null,null,null,null,null,null,""]
[null,null,28,null,null,"blau",{"$f":"COUNTIF(Kugeln!$X$4:$X$52,CONCATENATE(\"(\",Ergebnismenge!C217,\", \",F247,\")\"))","v":0},null,null,null,null,null,null,{"$f":"IF(AND(SUM($G$122:G246)>0,G247>0),\", \",\"\")","v":""},"",null,null,null,null,null,null,""]
[null,null,29,null,null,"blau",{"$f":"COUNTIF(Kugeln!$X$4:$X$52,CONCATENATE(\"(\",Ergebnismenge!C218,\", \",F248,\")\"))","v":0},null,null,null,null,null,null,{"$f":"IF(AND(SUM($G$122:G247)>0,G248>0),\", \",\"\")","v":""},"",null,null,null,null,null,null,""]
[null,null,30,null,null,"blau",{"$f":"COUNTIF(Kugeln!$X$4:$X$52,CONCATENATE(\"(\",Ergebnismenge!C219,\", \",F249,\")\"))","v":0},null,null,null,null,null,null,{"$f":"IF(AND(SUM($G$122:G248)>0,G249>0),\", \",\"\")","v":""},"",null,null,null,null,null,null,""]
[null,null,31,null,null,"blau",{"$f":"COUNTIF(Kugeln!$X$4:$X$52,CONCATENATE(\"(\",Ergebnismenge!C220,\", \",F250,\")\"))","v":0},null,null,null,null,null,null,{"$f":"IF(AND(SUM($G$122:G249)>0,G250>0),\", \",\"\")","v":""},"",null,null,null,null,null,null,""]
[null,null,32,null,null,"blau",{"$f":"COUNTIF(Kugeln!$X$4:$X$52,CONCATENATE(\"(\",Ergebnismenge!C221,\", \",F251,\")\"))","v":0},null,null,null,null,null,null,{"$f":"IF(AND(SUM($G$122:G250)>0,G251>0),\", \",\"\")","v":""},"",null,null,null,null,null,null,""]
[null,null,33,null,null,"blau",{"$f":"COUNTIF(Kugeln!$X$4:$X$52,CONCATENATE(\"(\",Ergebnismenge!C222,\", \",F252,\")\"))","v":0},null,null,null,null,null,null,{"$f":"IF(AND(SUM($G$122:G251)>0,G252>0),\", \",\"\")","v":""},"",null,null,null,null,null,null,""]
[null,null,34,null,null,"blau",{"$f":"COUNTIF(Kugeln!$X$4:$X$52,CONCATENATE(\"(\",Ergebnismenge!C223,\", \",F253,\")\"))","v":0},null,null,null,null,null,null,{"$f":"IF(AND(SUM($G$122:G252)>0,G253>0),\", \",\"\")","v":""},{"$f":"IF(G253>0,CONCATENATE(\"(\",F253,\", \",C253,\")\"),\"\")","v":""},null,null,null,null,null,null,""]
[null,null,35,null,null,"blau",{"$f":"COUNTIF(Kugeln!$X$4:$X$52,CONCATENATE(\"(\",Ergebnismenge!C224,\", \",F254,\")\"))","v":0},null,null,null,null,null,null,{"$f":"IF(AND(SUM($G$122:G253)>0,G254>0),\", \",\"\")","v":""},"",null,null,null,null,null,null,""]
[null,null,36,null,null,"blau",{"$f":"COUNTIF(Kugeln!$X$4:$X$52,CONCATENATE(\"(\",Ergebnismenge!C225,\", \",F255,\")\"))","v":0},null,null,null,null,null,null,{"$f":"IF(AND(SUM($G$122:G254)>0,G255>0),\", \",\"\")","v":""},"",null,null,null,null,null,null,{"$f":"CONCATENATE(N255,O255)","v":""}]
[null,null,37,null,null,"blau",{"$f":"COUNTIF(Kugeln!$X$4:$X$52,CONCATENATE(\"(\",Ergebnismenge!C226,\", \",F256,\")\"))","v":0},null,null,null,null,null,null,{"$f":"IF(AND(SUM($G$122:G255)>0,G256>0),\", \",\"\")","v":""},"",null,null,null,null,null,null,""]
[null,null,38,null,null,"blau",{"$f":"COUNTIF(Kugeln!$X$4:$X$52,CONCATENATE(\"(\",Ergebnismenge!C227,\", \",F257,\")\"))","v":0},null,null,null,null,null,null,{"$f":"IF(AND(SUM($G$122:G256)>0,G257>0),\", \",\"\")","v":""},"",null,null,null,null,null,null,""]
[null,null,39,null,null,"blau",{"$f":"COUNTIF(Kugeln!$X$4:$X$52,CONCATENATE(\"(\",Ergebnismenge!C228,\", \",F258,\")\"))","v":0},null,null,null,null,null,null,{"$f":"IF(AND(SUM($G$122:G257)>0,G258>0),\", \",\"\")","v":""},"",null,null,null,null,null,null,""]
[null,null,40,null,null,"blau",{"$f":"COUNTIF(Kugeln!$X$4:$X$52,CONCATENATE(\"(\",Ergebnismenge!C229,\", \",F259,\")\"))","v":0},null,null,null,null,null,null,{"$f":"IF(AND(SUM($G$122:G258)>0,G259>0),\", \",\"\")","v":""},"",null,null,null,null,null,null,""]
[null,null,41,null,null,"blau",{"$f":"COUNTIF(Kugeln!$X$4:$X$52,CONCATENATE(\"(\",Ergebnismenge!C230,\", \",F260,\")\"))","v":0},null,null,null,null,null,null,{"$f":"IF(AND(SUM($G$122:G259)>0,G260>0),\", \",\"\")","v":""},"",null,null,null,null,null,null,""]
[null,null,42,null,null,"blau",{"$f":"COUNTIF(Kugeln!$X$4:$X$52,CONCATENATE(\"(\",Ergebnismenge!C231,\", \",F261,\")\"))","v":0},null,null,null,null,null,null,{"$f":"IF(AND(SUM($G$122:G260)>0,G261>0),\", \",\"\")","v":""},"",null,null,null,null,null,null,""]
[null,null,43,null,null,"blau",{"$f":"COUNTIF(Kugeln!$X$4:$X$52,CONCATENATE(\"(\",Ergebnismenge!C232,\", \",F262,\")\"))","v":0},null,null,null,null,null,null,{"$f":"IF(AND(SUM($G$122:G261)>0,G262>0),\", \",\"\")","v":""},"",null,null,null,null,null,null,""]
[null,null,44,null,null,"blau",{"$f":"COUNTIF(Kugeln!$X$4:$X$52,CONCATENATE(\"(\",Ergebnismenge!C233,\", \",F263,\")\"))","v":0},null,null,null,null,null,null,{"$f":"IF(AND(SUM($G$122:G262)>0,G263>0),\", \",\"\")","v":""},"",null,null,null,null,null,null,""]
[null,null,45,null,null,"blau",{"$f":"COUNTIF(Kugeln!$X$4:$X$52,CONCATENATE(\"(\",Ergebnismenge!C234,\", \",F264,\")\"))","v":0},null,null,null,null,null,null,{"$f":"IF(AND(SUM($G$122:G263)>0,G264>0),\", \",\"\")","v":""},"",null,null,null,null,null,null,""]
[null,null,46,null,null,"blau",{"$f":"COUNTIF(Kugeln!$X$4:$X$52,CONCATENATE(\"(\",Ergebnismenge!C235,\", \",F265,\")\"))","v":0},null,null,null,null,null,null,{"$f":"IF(AND(SUM($G$122:G264)>0,G265>0),\", \",\"\")","v":""},"",null,null,null,null,null,null,""]
[null,null,47,null,null,"blau",{"$f":"COUNTIF(Kugeln!$X$4:$X$52,CONCATENATE(\"(\",Ergebnismenge!C236,\", \",F266,\")\"))","v":0},null,null,null,null,null,null,{"$f":"IF(AND(SUM($G$122:G265)>0,G266>0),\", \",\"\")","v":""},"",null,null,null,null,null,null,""]
[null,null,48,null,null,"blau",{"$f":"COUNTIF(Kugeln!$X$4:$X$52,CONCATENATE(\"(\",Ergebnismenge!C237,\", \",F267,\")\"))","v":0},null,null,null,null,null,null,{"$f":"IF(AND(SUM($G$122:G266)>0,G267>0),\", \",\"\")","v":""},"",null,null,null,null,null,null,""]
[null,null,49,null,null,"blau",{"$f":"COUNTIF(Kugeln!$X$4:$X$52,CONCATENATE(\"(\",Ergebnismenge!C238,\", \",F268,\")\"))","v":0},null,null,null,null,null,null,{"$f":"IF(AND(SUM($G$122:G267)>0,G268>0),\", \",\"\")","v":""},"",null,null,null,null,null,null,""]
[null,null,1,null,null,"gelb",{"$f":"COUNTIF(Kugeln!$X$4:$X$52,CONCATENATE(\"(\",Ergebnismenge!C239,\", \",F269,\")\"))","v":0},null,null,null,null,null,null,{"$f":"IF(AND(SUM($G$122:G268)>0,G269>0),\", \",\"\")","v":""},"",null,null,null,null,null,null,""]
[null,null,2,null,null,"gelb",{"$f":"COUNTIF(Kugeln!$X$4:$X$52,CONCATENATE(\"(\",Ergebnismenge!C240,\", \",F270,\")\"))","v":0},null,null,null,null,null,null,{"$f":"IF(AND(SUM($G$122:G269)>0,G270>0),\", \",\"\")","v":""},"",null,null,null,null,null,null,""]
[null,null,3,null,null,"gelb",{"$f":"COUNTIF(Kugeln!$X$4:$X$52,CONCATENATE(\"(\",Ergebnismenge!C241,\", \",F271,\")\"))","v":1},null,null,null,null,null,null,{"$f":"IF(AND(SUM($G$122:G270)>0,G271>0),\", \",\"\")","v":", "},"(gelb, 3)",null,null,null,null,null,null,", (gelb, 3)"]
[null,null,4,null,null,"gelb",{"$f":"COUNTIF(Kugeln!$X$4:$X$52,CONCATENATE(\"(\",Ergebnismenge!C242,\", \",F272,\")\"))","v":1},null,null,null,null,null,null,{"$f":"IF(AND(SUM($G$122:G271)>0,G272>0),\", \",\"\")","v":", "},"(gelb, 4)",null,null,null,null,null,null,", (gelb, 4)"]
[null,null,5,null,null,"gelb",{"$f":"COUNTIF(Kugeln!$X$4:$X$52,CONCATENATE(\"(\",Ergebnismenge!C243,\", \",F273,\")\"))","v":2},null,null,null,null,null,null,{"$f":"IF(AND(SUM($G$122:G272)>0,G273>0),\", \",\"\")","v":", "},"(gelb, 5)",null,null,null,null,null,null,", (gelb, 5)"]
[null,null,6,null,null,"gelb",{"$f":"COUNTIF(Kugeln!$X$4:$X$52,CONCATENATE(\"(\",Ergebnismenge!C244,\", \",F274,\")\"))","v":2},null,null,null,null,null,null,{"$f":"IF(AND(SUM($G$122:G273)>0,G274>0),\", \",\"\")","v":", "},"(gelb, 6)",null,null,null,null,null,null,", (gelb, 6)"]
[null,null,7,null,null,"gelb",{"$f":"COUNTIF(Kugeln!$X$4:$X$52,CONCATENATE(\"(\",Ergebnismenge!C245,\", \",F275,\")\"))","v":1},null,null,null,null,null,null,{"$f":"IF(AND(SUM($G$122:G274)>0,G275>0),\", \",\"\")","v":", "},"(gelb, 7)",null,null,null,null,null,null,", (gelb, 7)"]
[null,null,8,null,null,"gelb",{"$f":"COUNTIF(Kugeln!$X$4:$X$52,CONCATENATE(\"(\",Ergebnismenge!C246,\", \",F276,\")\"))","v":0},null,null,null,null,null,null,{"$f":"IF(AND(SUM($G$122:G275)>0,G276>0),\", \",\"\")","v":""},"",null,null,null,null,null,null,""]
[null,null,9,null,null,"gelb",{"$f":"COUNTIF(Kugeln!$X$4:$X$52,CONCATENATE(\"(\",Ergebnismenge!C247,\", \",F277,\")\"))","v":2},null,null,null,null,null,null,{"$f":"IF(AND(SUM($G$122:G276)>0,G277>0),\", \",\"\")","v":", "},"(gelb, 9)",null,null,null,null,null,null,", (gelb, 9)"]
[null,null,10,null,null,"gelb",{"$f":"COUNTIF(Kugeln!$X$4:$X$52,CONCATENATE(\"(\",Ergebnismenge!C248,\", \",F278,\")\"))","v":0},null,null,null,null,null,null,{"$f":"IF(AND(SUM($G$122:G277)>0,G278>0),\", \",\"\")","v":""},"",null,null,null,null,null,null,""]
[null,null,11,null,null,"gelb",{"$f":"COUNTIF(Kugeln!$X$4:$X$52,CONCATENATE(\"(\",Ergebnismenge!C249,\", \",F279,\")\"))","v":0},null,null,null,null,null,null,{"$f":"IF(AND(SUM($G$122:G278)>0,G279>0),\", \",\"\")","v":""},"",null,null,null,null,null,null,""]
[null,null,12,null,null,"gelb",{"$f":"COUNTIF(Kugeln!$X$4:$X$52,CONCATENATE(\"(\",Ergebnismenge!C250,\", \",F280,\")\"))","v":0},null,null,null,null,null,null,{"$f":"IF(AND(SUM($G$122:G279)>0,G280>0),\", \",\"\")","v":""},"",null,null,null,null,null,null,""]
[null,null,13,null,null,"gelb",{"$f":"COUNTIF(Kugeln!$X$4:$X$52,CONCATENATE(\"(\",Ergebnismenge!C251,\", \",F281,\")\"))","v":0},null,null,null,null,null,null,{"$f":"IF(AND(SUM($G$122:G280)>0,G281>0),\", \",\"\")","v":""},"",null,null,null,null,null,null,""]
[null,null,14,null,null,"gelb",{"$f":"COUNTIF(Kugeln!$X$4:$X$52,CONCATENATE(\"(\",Ergebnismenge!C252,\", \",F282,\")\"))","v":0},null,null,null,null,null,null,{"$f":"IF(AND(SUM($G$122:G281)>0,G282>0),\", \",\"\")","v":""},"",null,null,null,null,null,null,""]
[null,null,15,null,null,"gelb",{"$f":"COUNTIF(Kugeln!$X$4:$X$52,CONCATENATE(\"(\",Ergebnismenge!C253,\", \",F283,\")\"))","v":0},null,null,null,null,null,null,{"$f":"IF(AND(SUM($G$122:G282)>0,G283>0),\", \",\"\")","v":""},"",null,null,null,null,null,null,""]
[null,null,16,null,null,"gelb",{"$f":"COUNTIF(Kugeln!$X$4:$X$52,CONCATENATE(\"(\",Ergebnismenge!C254,\", \",F284,\")\"))","v":0},null,null,null,null,null,null,{"$f":"IF(AND(SUM($G$122:G283)>0,G284>0),\", \",\"\")","v":""},"",null,null,null,null,null,null,""]
[null,null,17,null,null,"gelb",{"$f":"COUNTIF(Kugeln!$X$4:$X$52,CONCATENATE(\"(\",Ergebnismenge!C255,\", \",F285,\")\"))","v":0},null,null,null,null,null,null,{"$f":"IF(AND(SUM($G$122:G284)>0,G285>0),\", \",\"\")","v":""},"",null,null,null,null,null,null,""]
[null,null,18,null,null,"gelb",{"$f":"COUNTIF(Kugeln!$X$4:$X$52,CONCATENATE(\"(\",Ergebnismenge!C256,\", \",F286,\")\"))","v":0},null,null,null,null,null,null,{"$f":"IF(AND(SUM($G$122:G285)>0,G286>0),\", \",\"\")","v":""},"",null,null,null,null,null,null,""]
[null,null,19,null,null,"gelb",{"$f":"COUNTIF(Kugeln!$X$4:$X$52,CONCATENATE(\"(\",Ergebnismenge!C257,\", \",F287,\")\"))","v":0},null,null,null,null,null,null,{"$f":"IF(AND(SUM($G$122:G286)>0,G287>0),\", \",\"\")","v":""},"",null,null,null,null,null,null,""]
[null,null,20,null,null,"gelb",{"$f":"COUNTIF(Kugeln!$X$4:$X$52,CONCATENATE(\"(\",Ergebnismenge!C258,\", \",F288,\")\"))","v":0},null,null,null,null,null,null,{"$f":"IF(AND(SUM($G$122:G287)>0,G288>0),\", \",\"\")","v":""},"",null,null,null,null,null,null,""]
[null,null,21,null,null,"gelb",{"$f":"COUNTIF(Kugeln!$X$4:$X$52,CONCATENATE(\"(\",Ergebnismenge!C259,\", \",F289,\")\"))","v":0},null,null,null,null,null,null,{"$f":"IF(AND(SUM($G$122:G288)>0,G289>0),\", \",\"\")","v":""},"",null,null,null,null,null,null,""]
[null,null,22,null,null,"gelb",{"$f":"COUNTIF(Kugeln!$X$4:$X$52,CONCATENATE(\"(\",Ergebnismenge!C260,\", \",F290,\")\"))","v":0},null,null,null,null,null,null,{"$f":"IF(AND(SUM($G$122:G289)>0,G290>0),\", \",\"\")","v":""},"",null,null,null,null,null,null,""]
[null,null,23,null,null,"gelb",{"$f":"COUNTIF(Kugeln!$X$4:$X$52,CONCATENATE(\"(\",Ergebnismenge!C261,\", \",F291,\")\"))","v":0},null,null,null,null,null,null,{"$f":"IF(AND(SUM($G$122:G290)>0,G291>0),\", \",\"\")","v":""},"",null,null,null,null,null,null,""]
[null,null,24,null,null,"gelb",{"$f":"COUNTIF(Kugeln!$X$4:$X$52,CONCATENATE(\"(\",Ergebnismenge!C262,\", \",F292,\")\"))","v":0},null,null,null,null,null,null,{"$f":"IF(AND(SUM($G$122:G291)>0,G292>0),\", \",\"\")","v":""},"",null,null,null,null,null,null,""]
[null,null,25,null,null,"gelb",{"$f":"COUNTIF(Kugeln!$X$4:$X$52,CONCATENATE(\"(\",Ergebnismenge!C263,\", \",F293,\")\"))","v":0},null,null,null,null,null,null,{"$f":"IF(AND(SUM($G$122:G292)>0,G293>0),\", \",\"\")","v":""},"",null,null,null,null,null,null,""]
[null,null,26,null,null,"gelb",{"$f":"COUNTIF(Kugeln!$X$4:$X$52,CONCATENATE(\"(\",Ergebnismenge!C264,\", \",F294,\")\"))","v":0},null,null,null,null,null,null,{"$f":"IF(AND(SUM($G$122:G293)>0,G294>0),\", \",\"\")","v":""},"",null,null,null,null,null,null,""]
[null,null,27,null,null,"gelb",{"$f":"COUNTIF(Kugeln!$X$4:$X$52,CONCATENATE(\"(\",Ergebnismenge!C265,\", \",F295,\")\"))","v":0},null,null,null,null,null,null,{"$f":"IF(AND(SUM($G$122:G294)>0,G295>0),\", \",\"\")","v":""},"",null,null,null,null,null,null,""]
[null,null,28,null,null,"gelb",{"$f":"COUNTIF(Kugeln!$X$4:$X$52,CONCATENATE(\"(\",Ergebnismenge!C266,\", \",F296,\")\"))","v":0},null,null,null,null,null,null,{"$f":"IF(AND(SUM($G$122:G295)>0,G296>0),\", \",\"\")","v":""},"",null,null,null,null,null,null,""]
[null,null,29,null,null,"gelb",{"$f":"COUNTIF(Kugeln!$X$4:$X$52,CONCATENATE(\"(\",Ergebnismenge!C267,\", \",F297,\")\"))","v":0},null,null,null,null,null,null,{"$f":"IF(AND(SUM($G$122:G296)>0,G297>0),\", \",\"\")","v":""},"",null,null,null,null,null,null,""]
[null,null,30,null,null,"gelb",{"$f":"COUNTIF(Kugeln!$X$4:$X$52,CONCATENATE(\"(\",Ergebnismenge!C268,\", \",F298,\")\"))","v":0},null,null,null,null,null,null,{"$f":"IF(AND(SUM($G$122:G297)>0,G298>0),\", \",\"\")","v":""},"",null,null,null,null,null,null,""]
[null,null,31,null,null,"gelb",{"$f":"COUNTIF(Kugeln!$X$4:$X$52,CONCATENATE(\"(\",Ergebnismenge!C269,\", \",F299,\")\"))","v":0},null,null,null,null,null,null,{"$f":"IF(AND(SUM($G$122:G298)>0,G299>0),\", \",\"\")","v":""},"",null,null,null,null,null,null,""]
[null,null,32,null,null,"gelb",{"$f":"COUNTIF(Kugeln!$X$4:$X$52,CONCATENATE(\"(\",Ergebnismenge!C270,\", \",F300,\")\"))","v":0},null,null,null,null,null,null,{"$f":"IF(AND(SUM($G$122:G299)>0,G300>0),\", \",\"\")","v":""},"",null,null,null,null,null,null,""]
[null,null,33,null,null,"gelb",{"$f":"COUNTIF(Kugeln!$X$4:$X$52,CONCATENATE(\"(\",Ergebnismenge!C271,\", \",F301,\")\"))","v":0},null,null,null,null,null,null,{"$f":"IF(AND(SUM($G$122:G300)>0,G301>0),\", \",\"\")","v":""},"",null,null,null,null,null,null,""]
[null,null,34,null,null,"gelb",{"$f":"COUNTIF(Kugeln!$X$4:$X$52,CONCATENATE(\"(\",Ergebnismenge!C272,\", \",F302,\")\"))","v":0},null,null,null,null,null,null,{"$f":"IF(AND(SUM($G$122:G301)>0,G302>0),\", \",\"\")","v":""},"",null,null,null,null,null,null,""]
[null,null,35,null,null,"gelb",{"$f":"COUNTIF(Kugeln!$X$4:$X$52,CONCATENATE(\"(\",Ergebnismenge!C273,\", \",F303,\")\"))","v":0},null,null,null,null,null,null,{"$f":"IF(AND(SUM($G$122:G302)>0,G303>0),\", \",\"\")","v":""},"",null,null,null,null,null,null,""]
[null,null,36,null,null,"gelb",{"$f":"COUNTIF(Kugeln!$X$4:$X$52,CONCATENATE(\"(\",Ergebnismenge!C274,\", \",F304,\")\"))","v":0},null,null,null,null,null,null,{"$f":"IF(AND(SUM($G$122:G303)>0,G304>0),\", \",\"\")","v":""},"",null,null,null,null,null,null,""]
[null,null,37,null,null,"gelb",{"$f":"COUNTIF(Kugeln!$X$4:$X$52,CONCATENATE(\"(\",Ergebnismenge!C275,\", \",F305,\")\"))","v":0},null,null,null,null,null,null,{"$f":"IF(AND(SUM($G$122:G304)>0,G305>0),\", \",\"\")","v":""},"",null,null,null,null,null,null,""]
[null,null,38,null,null,"gelb",{"$f":"COUNTIF(Kugeln!$X$4:$X$52,CONCATENATE(\"(\",Ergebnismenge!C276,\", \",F306,\")\"))","v":0},null,null,null,null,null,null,{"$f":"IF(AND(SUM($G$122:G305)>0,G306>0),\", \",\"\")","v":""},"",null,null,null,null,null,null,""]
[null,null,39,null,null,"gelb",{"$f":"COUNTIF(Kugeln!$X$4:$X$52,CONCATENATE(\"(\",Ergebnismenge!C277,\", \",F307,\")\"))","v":0},null,null,null,null,null,null,{"$f":"IF(AND(SUM($G$122:G306)>0,G307>0),\", \",\"\")","v":""},"",null,null,null,null,null,null,""]
[null,null,40,null,null,"gelb",{"$f":"COUNTIF(Kugeln!$X$4:$X$52,CONCATENATE(\"(\",Ergebnismenge!C278,\", \",F308,\")\"))","v":0},null,null,null,null,null,null,{"$f":"IF(AND(SUM($G$122:G307)>0,G308>0),\", \",\"\")","v":""},"",null,null,null,null,null,null,""]
[null,null,41,null,null,"gelb",{"$f":"COUNTIF(Kugeln!$X$4:$X$52,CONCATENATE(\"(\",Ergebnismenge!C279,\", \",F309,\")\"))","v":0},null,null,null,null,null,null,{"$f":"IF(AND(SUM($G$122:G308)>0,G309>0),\", \",\"\")","v":""},"",null,null,null,null,null,null,""]
[null,null,42,null,null,"gelb",{"$f":"COUNTIF(Kugeln!$X$4:$X$52,CONCATENATE(\"(\",Ergebnismenge!C280,\", \",F310,\")\"))","v":0},null,null,null,null,null,null,{"$f":"IF(AND(SUM($G$122:G309)>0,G310>0),\", \",\"\")","v":""},"",null,null,null,null,null,null,""]
[null,null,43,null,null,"gelb",{"$f":"COUNTIF(Kugeln!$X$4:$X$52,CONCATENATE(\"(\",Ergebnismenge!C281,\", \",F311,\")\"))","v":0},null,null,null,null,null,null,{"$f":"IF(AND(SUM($G$122:G310)>0,G311>0),\", \",\"\")","v":""},"",null,null,null,null,null,null,""]
[null,null,44,null,null,"gelb",{"$f":"COUNTIF(Kugeln!$X$4:$X$52,CONCATENATE(\"(\",Ergebnismenge!C282,\", \",F312,\")\"))","v":0},null,null,null,null,null,null,{"$f":"IF(AND(SUM($G$122:G311)>0,G312>0),\", \",\"\")","v":""},"",null,null,null,null,null,null,""]
[null,null,45,null,null,"gelb",{"$f":"COUNTIF(Kugeln!$X$4:$X$52,CONCATENATE(\"(\",Ergebnismenge!C283,\", \",F313,\")\"))","v":0},null,null,null,null,null,null,{"$f":"IF(AND(SUM($G$122:G312)>0,G313>0),\", \",\"\")","v":""},"",null,null,null,null,null,null,""]
[null,null,46,null,null,"gelb",{"$f":"COUNTIF(Kugeln!$X$4:$X$52,CONCATENATE(\"(\",Ergebnismenge!C284,\", \",F314,\")\"))","v":0},null,null,null,null,null,null,{"$f":"IF(AND(SUM($G$122:G313)>0,G314>0),\", \",\"\")","v":""},"",null,null,null,null,null,null,""]
[null,null,47,null,null,"gelb",{"$f":"COUNTIF(Kugeln!$X$4:$X$52,CONCATENATE(\"(\",Ergebnismenge!C285,\", \",F315,\")\"))","v":0},null,null,null,null,null,null,{"$f":"IF(AND(SUM($G$122:G314)>0,G315>0),\", \",\"\")","v":""},"",null,null,null,null,null,null,""]
[null,null,48,null,null,"gelb",{"$f":"COUNTIF(Kugeln!$X$4:$X$52,CONCATENATE(\"(\",Ergebnismenge!C286,\", \",F316,\")\"))","v":0},null,null,null,null,null,null,{"$f":"IF(AND(SUM($G$122:G315)>0,G316>0),\", \",\"\")","v":""},"",null,null,null,null,null,null,""]
[null,null,49,null,null,"gelb",{"$f":"COUNTIF(Kugeln!$X$4:$X$52,CONCATENATE(\"(\",Ergebnismenge!C287,\", \",F317,\")\"))","v":0},null,null,null,null,null,null,{"$f":"IF(AND(SUM($G$122:G316)>0,G317>0),\", \",\"\")","v":""},{"$f":"IF(G317>0,CONCATENATE(\"(\",F317,\", \",C317,\")\"),\"\")","v":""},null,null,null,null,null,null,""]
[null,null,1,null,null,"grau",{"$f":"COUNTIF(Kugeln!$X$4:$X$52,CONCATENATE(\"(\",Ergebnismenge!C288,\", \",F318,\")\"))","v":0},null,null,null,null,null,null,{"$f":"IF(AND(SUM($G$122:G317)>0,G318>0),\", \",\"\")","v":""},"",null,null,null,null,null,null,""]
[null,null,2,null,null,"grau",{"$f":"COUNTIF(Kugeln!$X$4:$X$52,CONCATENATE(\"(\",Ergebnismenge!C289,\", \",F319,\")\"))","v":4},null,null,null,null,null,null,{"$f":"IF(AND(SUM($G$122:G318)>0,G319>0),\", \",\"\")","v":", "},"(grau, 2)",null,null,null,null,null,null,{"$f":"CONCATENATE(N319,O319)","v":", (grau, 2)"}]
[null,null,3,null,null,"grau",{"$f":"COUNTIF(Kugeln!$X$4:$X$52,CONCATENATE(\"(\",Ergebnismenge!C290,\", \",F320,\")\"))","v":1},null,null,null,null,null,null,{"$f":"IF(AND(SUM($G$122:G319)>0,G320>0),\", \",\"\")","v":", "},"(grau, 3)",null,null,null,null,null,null,", (grau, 3)"]
[null,null,4,null,null,"grau",{"$f":"COUNTIF(Kugeln!$X$4:$X$52,CONCATENATE(\"(\",Ergebnismenge!C291,\", \",F321,\")\"))","v":1},null,null,null,null,null,null,{"$f":"IF(AND(SUM($G$122:G320)>0,G321>0),\", \",\"\")","v":", "},"(grau, 4)",null,null,null,null,null,null,", (grau, 4)"]
[null,null,5,null,null,"grau",{"$f":"COUNTIF(Kugeln!$X$4:$X$52,CONCATENATE(\"(\",Ergebnismenge!C292,\", \",F322,\")\"))","v":2},null,null,null,null,null,null,{"$f":"IF(AND(SUM($G$122:G321)>0,G322>0),\", \",\"\")","v":", "},"(grau, 5)",null,null,null,null,null,null,", (grau, 5)"]
[null,null,6,null,null,"grau",{"$f":"COUNTIF(Kugeln!$X$4:$X$52,CONCATENATE(\"(\",Ergebnismenge!C293,\", \",F323,\")\"))","v":1},null,null,null,null,null,null,{"$f":"IF(AND(SUM($G$122:G322)>0,G323>0),\", \",\"\")","v":", "},"(grau, 6)",null,null,null,null,null,null,", (grau, 6)"]
[null,null,7,null,null,"grau",{"$f":"COUNTIF(Kugeln!$X$4:$X$52,CONCATENATE(\"(\",Ergebnismenge!C294,\", \",F324,\")\"))","v":2},null,null,null,null,null,null,{"$f":"IF(AND(SUM($G$122:G323)>0,G324>0),\", \",\"\")","v":", "},"(grau, 7)",null,null,null,null,null,null,", (grau, 7)"]
[null,null,8,null,null,"grau",{"$f":"COUNTIF(Kugeln!$X$4:$X$52,CONCATENATE(\"(\",Ergebnismenge!C295,\", \",F325,\")\"))","v":1},null,null,null,null,null,null,{"$f":"IF(AND(SUM($G$122:G324)>0,G325>0),\", \",\"\")","v":", "},"(grau, 8)",null,null,null,null,null,null,", (grau, 8)"]
[null,null,9,null,null,"grau",{"$f":"COUNTIF(Kugeln!$X$4:$X$52,CONCATENATE(\"(\",Ergebnismenge!C296,\", \",F326,\")\"))","v":0},null,null,null,null,null,null,{"$f":"IF(AND(SUM($G$122:G325)>0,G326>0),\", \",\"\")","v":""},"",null,null,null,null,null,null,""]
[null,null,10,null,null,"grau",{"$f":"COUNTIF(Kugeln!$X$4:$X$52,CONCATENATE(\"(\",Ergebnismenge!C297,\", \",F327,\")\"))","v":0},null,null,null,null,null,null,{"$f":"IF(AND(SUM($G$122:G326)>0,G327>0),\", \",\"\")","v":""},"",null,null,null,null,null,null,""]
[null,null,11,null,null,"grau",{"$f":"COUNTIF(Kugeln!$X$4:$X$52,CONCATENATE(\"(\",Ergebnismenge!C298,\", \",F328,\")\"))","v":0},null,null,null,null,null,null,{"$f":"IF(AND(SUM($G$122:G327)>0,G328>0),\", \",\"\")","v":""},"",null,null,null,null,null,null,""]
[null,null,12,null,null,"grau",{"$f":"COUNTIF(Kugeln!$X$4:$X$52,CONCATENATE(\"(\",Ergebnismenge!C299,\", \",F329,\")\"))","v":0},null,null,null,null,null,null,{"$f":"IF(AND(SUM($G$122:G328)>0,G329>0),\", \",\"\")","v":""},"",null,null,null,null,null,null,""]
[null,null,13,null,null,"grau",{"$f":"COUNTIF(Kugeln!$X$4:$X$52,CONCATENATE(\"(\",Ergebnismenge!C300,\", \",F330,\")\"))","v":0},null,null,null,null,null,null,{"$f":"IF(AND(SUM($G$122:G329)>0,G330>0),\", \",\"\")","v":""},"",null,null,null,null,null,null,""]
[null,null,14,null,null,"grau",{"$f":"COUNTIF(Kugeln!$X$4:$X$52,CONCATENATE(\"(\",Ergebnismenge!C301,\", \",F331,\")\"))","v":0},null,null,null,null,null,null,{"$f":"IF(AND(SUM($G$122:G330)>0,G331>0),\", \",\"\")","v":""},"",null,null,null,null,null,null,""]
[null,null,15,null,null,"grau",{"$f":"COUNTIF(Kugeln!$X$4:$X$52,CONCATENATE(\"(\",Ergebnismenge!C302,\", \",F332,\")\"))","v":0},null,null,null,null,null,null,{"$f":"IF(AND(SUM($G$122:G331)>0,G332>0),\", \",\"\")","v":""},"",null,null,null,null,null,null,""]
[null,null,16,null,null,"grau",{"$f":"COUNTIF(Kugeln!$X$4:$X$52,CONCATENATE(\"(\",Ergebnismenge!C303,\", \",F333,\")\"))","v":0},null,null,null,null,null,null,{"$f":"IF(AND(SUM($G$122:G332)>0,G333>0),\", \",\"\")","v":""},"",null,null,null,null,null,null,""]
[null,null,17,null,null,"grau",{"$f":"COUNTIF(Kugeln!$X$4:$X$52,CONCATENATE(\"(\",Ergebnismenge!C304,\", \",F334,\")\"))","v":0},null,null,null,null,null,null,{"$f":"IF(AND(SUM($G$122:G333)>0,G334>0),\", \",\"\")","v":""},"",null,null,null,null,null,null,""]
[null,null,18,null,null,"grau",{"$f":"COUNTIF(Kugeln!$X$4:$X$52,CONCATENATE(\"(\",Ergebnismenge!C305,\", \",F335,\")\"))","v":0},null,null,null,null,null,null,{"$f":"IF(AND(SUM($G$122:G334)>0,G335>0),\", \",\"\")","v":""},"",null,null,null,null,null,null,""]
[null,null,19,null,null,"grau",{"$f":"COUNTIF(Kugeln!$X$4:$X$52,CONCATENATE(\"(\",Ergebnismenge!C306,\", \",F336,\")\"))","v":0},null,null,null,null,null,null,{"$f":"IF(AND(SUM($G$122:G335)>0,G336>0),\", \",\"\")","v":""},"",null,null,null,null,null,null,""]
[null,null,20,null,null,"grau",{"$f":"COUNTIF(Kugeln!$X$4:$X$52,CONCATENATE(\"(\",Ergebnismenge!C307,\", \",F337,\")\"))","v":0},null,null,null,null,null,null,{"$f":"IF(AND(SUM($G$122:G336)>0,G337>0),\", \",\"\")","v":""},"",null,null,null,null,null,null,""]
[null,null,21,null,null,"grau",{"$f":"COUNTIF(Kugeln!$X$4:$X$52,CONCATENATE(\"(\",Ergebnismenge!C308,\", \",F338,\")\"))","v":0},null,null,null,null,null,null,{"$f":"IF(AND(SUM($G$122:G337)>0,G338>0),\", \",\"\")","v":""},"",null,null,null,null,null,null,""]
[null,null,22,null,null,"grau",{"$f":"COUNTIF(Kugeln!$X$4:$X$52,CONCATENATE(\"(\",Ergebnismenge!C309,\", \",F339,\")\"))","v":0},null,null,null,null,null,null,{"$f":"IF(AND(SUM($G$122:G338)>0,G339>0),\", \",\"\")","v":""},"",null,null,null,null,null,null,""]
[null,null,23,null,null,"grau",{"$f":"COUNTIF(Kugeln!$X$4:$X$52,CONCATENATE(\"(\",Ergebnismenge!C310,\", \",F340,\")\"))","v":0},null,null,null,null,null,null,{"$f":"IF(AND(SUM($G$122:G339)>0,G340>0),\", \",\"\")","v":""},"",null,null,null,null,null,null,""]
[null,null,24,null,null,"grau",{"$f":"COUNTIF(Kugeln!$X$4:$X$52,CONCATENATE(\"(\",Ergebnismenge!C311,\", \",F341,\")\"))","v":0},null,null,null,null,null,null,{"$f":"IF(AND(SUM($G$122:G340)>0,G341>0),\", \",\"\")","v":""},"",null,null,null,null,null,null,""]
[null,null,25,null,null,"grau",{"$f":"COUNTIF(Kugeln!$X$4:$X$52,CONCATENATE(\"(\",Ergebnismenge!C312,\", \",F342,\")\"))","v":0},null,null,null,null,null,null,{"$f":"IF(AND(SUM($G$122:G341)>0,G342>0),\", \",\"\")","v":""},"",null,null,null,null,null,null,""]
[null,null,26,null,null,"grau",{"$f":"COUNTIF(Kugeln!$X$4:$X$52,CONCATENATE(\"(\",Ergebnismenge!C313,\", \",F343,\")\"))","v":0},null,null,null,null,null,null,{"$f":"IF(AND(SUM($G$122:G342)>0,G343>0),\", \",\"\")","v":""},"",null,null,null,null,null,null,""]
[null,null,27,null,null,"grau",{"$f":"COUNTIF(Kugeln!$X$4:$X$52,CONCATENATE(\"(\",Ergebnismenge!C314,\", \",F344,\")\"))","v":0},null,null,null,null,null,null,{"$f":"IF(AND(SUM($G$122:G343)>0,G344>0),\", \",\"\")","v":""},"",null,null,null,null,null,null,""]
[null,null,28,null,null,"grau",{"$f":"COUNTIF(Kugeln!$X$4:$X$52,CONCATENATE(\"(\",Ergebnismenge!C315,\", \",F345,\")\"))","v":0},null,null,null,null,null,null,{"$f":"IF(AND(SUM($G$122:G344)>0,G345>0),\", \",\"\")","v":""},"",null,null,null,null,null,null,""]
[null,null,29,null,null,"grau",{"$f":"COUNTIF(Kugeln!$X$4:$X$52,CONCATENATE(\"(\",Ergebnismenge!C316,\", \",F346,\")\"))","v":0},null,null,null,null,null,null,{"$f":"IF(AND(SUM($G$122:G345)>0,G346>0),\", \",\"\")","v":""},"",null,null,null,null,null,null,""]
[null,null,30,null,null,"grau",{"$f":"COUNTIF(Kugeln!$X$4:$X$52,CONCATENATE(\"(\",Ergebnismenge!C317,\", \",F347,\")\"))","v":0},null,null,null,null,null,null,{"$f":"IF(AND(SUM($G$122:G346)>0,G347>0),\", \",\"\")","v":""},"",null,null,null,null,null,null,""]
[null,null,31,null,null,"grau",{"$f":"COUNTIF(Kugeln!$X$4:$X$52,CONCATENATE(\"(\",Ergebnismenge!C318,\", \",F348,\")\"))","v":0},null,null,null,null,null,null,{"$f":"IF(AND(SUM($G$122:G347)>0,G348>0),\", \",\"\")","v":""},"",null,null,null,null,null,null,""]
[null,null,32,null,null,"grau",{"$f":"COUNTIF(Kugeln!$X$4:$X$52,CONCATENATE(\"(\",Ergebnismenge!C319,\", \",F349,\")\"))","v":0},null,null,null,null,null,null,{"$f":"IF(AND(SUM($G$122:G348)>0,G349>0),\", \",\"\")","v":""},"",null,null,null,null,null,null,""]
[null,null,33,null,null,"grau",{"$f":"COUNTIF(Kugeln!$X$4:$X$52,CONCATENATE(\"(\",Ergebnismenge!C320,\", \",F350,\")\"))","v":0},null,null,null,null,null,null,{"$f":"IF(AND(SUM($G$122:G349)>0,G350>0),\", \",\"\")","v":""},"",null,null,null,null,null,null,""]
[null,null,34,null,null,"grau",{"$f":"COUNTIF(Kugeln!$X$4:$X$52,CONCATENATE(\"(\",Ergebnismenge!C321,\", \",F351,\")\"))","v":0},null,null,null,null,null,null,{"$f":"IF(AND(SUM($G$122:G350)>0,G351>0),\", \",\"\")","v":""},"",null,null,null,null,null,null,""]
[null,null,35,null,null,"grau",{"$f":"COUNTIF(Kugeln!$X$4:$X$52,CONCATENATE(\"(\",Ergebnismenge!C322,\", \",F352,\")\"))","v":0},null,null,null,null,null,null,{"$f":"IF(AND(SUM($G$122:G351)>0,G352>0),\", \",\"\")","v":""},"",null,null,null,null,null,null,""]
[null,null,36,null,null,"grau",{"$f":"COUNTIF(Kugeln!$X$4:$X$52,CONCATENATE(\"(\",Ergebnismenge!C323,\", \",F353,\")\"))","v":0},null,null,null,null,null,null,{"$f":"IF(AND(SUM($G$122:G352)>0,G353>0),\", \",\"\")","v":""},"",null,null,null,null,null,null,""]
[null,null,37,null,null,"grau",{"$f":"COUNTIF(Kugeln!$X$4:$X$52,CONCATENATE(\"(\",Ergebnismenge!C324,\", \",F354,\")\"))","v":0},null,null,null,null,null,null,{"$f":"IF(AND(SUM($G$122:G353)>0,G354>0),\", \",\"\")","v":""},"",null,null,null,null,null,null,""]
[null,null,38,null,null,"grau",{"$f":"COUNTIF(Kugeln!$X$4:$X$52,CONCATENATE(\"(\",Ergebnismenge!C325,\", \",F355,\")\"))","v":0},null,null,null,null,null,null,{"$f":"IF(AND(SUM($G$122:G354)>0,G355>0),\", \",\"\")","v":""},"",null,null,null,null,null,null,""]
[null,null,39,null,null,"grau",{"$f":"COUNTIF(Kugeln!$X$4:$X$52,CONCATENATE(\"(\",Ergebnismenge!C326,\", \",F356,\")\"))","v":0},null,null,null,null,null,null,{"$f":"IF(AND(SUM($G$122:G355)>0,G356>0),\", \",\"\")","v":""},"",null,null,null,null,null,null,""]
[null,null,40,null,null,"grau",{"$f":"COUNTIF(Kugeln!$X$4:$X$52,CONCATENATE(\"(\",Ergebnismenge!C327,\", \",F357,\")\"))","v":0},null,null,null,null,null,null,{"$f":"IF(AND(SUM($G$122:G356)>0,G357>0),\", \",\"\")","v":""},"",null,null,null,null,null,null,""]
[null,null,41,null,null,"grau",{"$f":"COUNTIF(Kugeln!$X$4:$X$52,CONCATENATE(\"(\",Ergebnismenge!C328,\", \",F358,\")\"))","v":0},null,null,null,null,null,null,{"$f":"IF(AND(SUM($G$122:G357)>0,G358>0),\", \",\"\")","v":""},"",null,null,null,null,null,null,""]
[null,null,42,null,null,"grau",{"$f":"COUNTIF(Kugeln!$X$4:$X$52,CONCATENATE(\"(\",Ergebnismenge!C329,\", \",F359,\")\"))","v":0},null,null,null,null,null,null,{"$f":"IF(AND(SUM($G$122:G358)>0,G359>0),\", \",\"\")","v":""},"",null,null,null,null,null,null,""]
[null,null,43,null,null,"grau",{"$f":"COUNTIF(Kugeln!$X$4:$X$52,CONCATENATE(\"(\",Ergebnismenge!C330,\", \",F360,\")\"))","v":0},null,null,null,null,null,null,{"$f":"IF(AND(SUM($G$122:G359)>0,G360>0),\", \",\"\")","v":""},"",null,null,null,null,null,null,""]
[null,null,44,null,null,"grau",{"$f":"COUNTIF(Kugeln!$X$4:$X$52,CONCATENATE(\"(\",Ergebnismenge!C331,\", \",F361,\")\"))","v":0},null,null,null,null,null,null,{"$f":"IF(AND(SUM($G$122:G360)>0,G361>0),\", \",\"\")","v":""},"",null,null,null,null,null,null,""]
[null,null,45,null,null,"grau",{"$f":"COUNTIF(Kugeln!$X$4:$X$52,CONCATENATE(\"(\",Ergebnismenge!C332,\", \",F362,\")\"))","v":0},null,null,null,null,null,null,{"$f":"IF(AND(SUM($G$122:G361)>0,G362>0),\", \",\"\")","v":""},"",null,null,null,null,null,null,""]
[null,null,46,null,null,"grau",{"$f":"COUNTIF(Kugeln!$X$4:$X$52,CONCATENATE(\"(\",Ergebnismenge!C333,\", \",F363,\")\"))","v":0},null,null,null,null,null,null,{"$f":"IF(AND(SUM($G$122:G362)>0,G363>0),\", \",\"\")","v":""},"",null,null,null,null,null,null,""]
[null,null,47,null,null,"grau",{"$f":"COUNTIF(Kugeln!$X$4:$X$52,CONCATENATE(\"(\",Ergebnismenge!C334,\", \",F364,\")\"))","v":0},null,null,null,null,null,null,{"$f":"IF(AND(SUM($G$122:G363)>0,G364>0),\", \",\"\")","v":""},"",null,null,null,null,null,null,""]
[null,null,48,null,null,"grau",{"$f":"COUNTIF(Kugeln!$X$4:$X$52,CONCATENATE(\"(\",Ergebnismenge!C335,\", \",F365,\")\"))","v":0},null,null,null,null,null,null,{"$f":"IF(AND(SUM($G$122:G364)>0,G365>0),\", \",\"\")","v":""},"",null,null,null,null,null,null,""]
[null,null,49,null,null,"grau",{"$f":"COUNTIF(Kugeln!$X$4:$X$52,CONCATENATE(\"(\",Ergebnismenge!C336,\", \",F366,\")\"))","v":0},null,null,null,null,null,null,{"$f":"IF(AND(SUM($G$122:G365)>0,G366>0),\", \",\"\")","v":""},"",null,null,null,null,null,null,""]
[]
[null,null,"Anzahl",null,null,null,{"$f":"SUM(G122:G366)","v":49}]
[]
[null,null,"|Ω| =",null,null,null,{"$f":"COUNTIF(G122:G366,\">0\")","v":31}]

{"sheet":"Ereignis-W. (2)","index":4,"n_rows":356,"n_cols":51,"rows_kept":356,"cut":false,"hidden":false,"merged":[[10,29,11,29],[10,30,11,30],[10,31,11,31],[10,32,11,32],[10,36,11,36],[12,29,13,29],[12,30,13,30],[12,31,13,31],[12,32,13,32],[12,36,13,36],[14,29,15,29],[14,30,15,30],[14,31,15,31],[14,32,15,32],[14,36,15,36],[16,29,17,29],[16,30,17,30],[16,31,17,31],[16,32,17,32],[16,36,17,36],[16,34,17,35],[33,33,33,35],[13,40,14,40],[10,34,11,35],[12,34,13,35],[14,34,15,35],[13,38,14,39],[13,37,14,37],[8,30,8,32],[37,41,37,43],[6,30,7,47],[35,29,35,31],[35,33,35,35],[37,33,37,35],[13,41,14,42],[29,32,30,32],[31,32,32,32],[33,32,34,32],[25,29,25,30],[29,29,29,31],[29,33,29,35],[31,29,31,31],[31,33,31,35],[33,29,33,31]]}
[]
[null,null,null,null,null,null,null,null,null,null,null,null,null,null,null,null,null,null,null,null,null,null,null,null,null,null,null,null,null,null,null,null,null,null,null,null,null,null,null,null,null,null,null,null,null,null,null,null,null,null,true]
[null,"Gefäß mit Kugeln: ",null,null,null,null,null,null,null,{"$f":"Kugeln!Y54","v":49},"Stück",null,null,null,null,null,null,null,null,null,null,null,null,null,null,null,null,null,null,"Ereignis-Wahrscheinlichkeiten (2)",null,null,null,null,null,null,null,null,null,null,null,false]
[]
[null,{"$f":"Kugeln!Y4","v":7},null,1,null,{"$f":"Kugeln!Y11","v":9},null,8,null,{"$f":"Kugeln!Y18","v":5},null,15,null,{"$f":"Kugeln!Y25","v":2},null,22,null,{"$f":"Kugeln!Y32","v":6},null,29,null,{"$f":"Kugeln!Y39","v":5},null,36,null,{"$f":"Kugeln!Y46","v":5},null,43,null,"2.  Es wird 1-mal gezogen, Beobachtungskriterium: Zahl"]
[]
[null,{"$f":"Kugeln!Y5","v":8},null,2,null,{"$f":"Kugeln!Y12","v":6},null,9,null,{"$f":"Kugeln!Y19","v":3},null,16,null,{"$f":"Kugeln!Y26","v":2},null,23,null,{"$f":"Kugeln!Y33","v":9},null,30,null,{"$f":"Kugeln!Y40","v":2},null,37,null,{"$f":"Kugeln!Y47","v":6},null,44,null,"Ω   =",{"$f":"CONCATENATE(\"{\",V55,V56,V57,V58,V59,V60,V61,V62,V63,V64,V65,V66,V67,V68,V69,V70,V71,V72,V73,V74,V75,V76,V77,V78,V79,V80,V81,V82,V83,V84,V85,V86,V87,V88,V89,V90,V91,V92,V93,V94,V95,V96,V97,V98,V99,V100,V101,V102,V103,\"}\")","v":"{2, 3, 4, 5, 6, 7, 8, 9}"}]
[]
[null,{"$f":"Kugeln!Y6","v":4},null,3,null,{"$f":"Kugeln!Y13","v":7},null,10,null,{"$f":"Kugeln!Y20","v":7},null,17,null,{"$f":"Kugeln!Y27","v":2},null,24,null,{"$f":"Kugeln!Y34","v":7},null,31,null,{"$f":"Kugeln!Y41","v":9},null,38,null,{"$f":"Kugeln!Y48","v":3},null,45,null,"|Ω| =",{"$f":"G104","v":8}]
[]
[null,{"$f":"Kugeln!Y7","v":2},null,4,null,{"$f":"Kugeln!Y14","v":8},null,11,null,{"$f":"Kugeln!Y21","v":5},null,18,null,{"$f":"Kugeln!Y28","v":5},null,25,null,{"$f":"Kugeln!Y35","v":7},null,32,null,{"$f":"Kugeln!Y42","v":6},null,39,null,{"$f":"Kugeln!Y49","v":6},null,46,null,"P(",1,")","=",{"$f":"INDEX($G$55:$G$103,AE11)","v":0},"≅",null,{"$f":"AH11/AH12","v":0}]
[null,null,null,null,null,null,null,null,null,null,null,null,null,null,null,null,null,null,null,null,null,null,null,null,null,null,null,null,null,null,null,null,null,{"$f":"$J$3","v":49}]
[null,{"$f":"Kugeln!Y8","v":2},null,5,null,{"$f":"Kugeln!Y15","v":7},null,12,null,{"$f":"Kugeln!Y22","v":2},null,19,null,{"$f":"Kugeln!Y29","v":9},null,26,null,{"$f":"Kugeln!Y36","v":6},null,33,null,{"$f":"Kugeln!Y43","v":8},null,40,null,{"$f":"Kugeln!Y50","v":8},null,47,null,"P(",{"$f":"AE11+1","v":2},")","=",{"$f":"INDEX($G$55:$G$103,AE13)","v":8},"≅",null,{"$f":"AH13/AH14","v":0.16326530612244897}]
[null,null,null,null,null,null,null,null,null,null,null,null,null,null,null,null,null,null,null,null,null,null,null,null,null,null,null,null,null,null,null,null,null,{"$f":"$J$3","v":49},null,null,null,"⇒",{"$f":"CONCATENATE(\"P([ \",AE11,\" ; \",AE17,\" ])\")","v":"P([ 1 ; 4 ])"},null,"≅",{"$f":"ROUND(SUM(AK11:AK18),4)","v":0.32650000000000001}]
[null,{"$f":"Kugeln!Y9","v":5},null,6,null,{"$f":"Kugeln!Y16","v":4},null,13,null,{"$f":"Kugeln!Y23","v":9},null,20,null,{"$f":"Kugeln!Y30","v":4},null,27,null,{"$f":"Kugeln!Y37","v":5},null,34,null,{"$f":"Kugeln!Y44","v":4},null,41,null,{"$f":"Kugeln!Y51","v":4},null,48,null,"P(",{"$f":"AE13+1","v":3},")","=",{"$f":"INDEX($G$55:$G$103,AE15)","v":3},"≅",null,{"$f":"AH15/AH16","v":6.1224489795918366E-2}]
[null,null,null,null,null,null,null,null,null,null,null,null,null,null,null,null,null,null,null,null,null,null,null,null,null,null,null,null,null,null,null,null,null,{"$f":"$J$3","v":49}]
[null,{"$f":"Kugeln!Y10","v":8},null,7,null,{"$f":"Kugeln!Y17","v":2},null,14,null,{"$f":"Kugeln!Y24","v":8},null,21,null,{"$f":"Kugeln!Y31","v":3},null,28,null,{"$f":"Kugeln!Y38","v":7},null,35,null,{"$f":"Kugeln!Y45","v":6},null,42,null,{"$f":"Kugeln!Y52","v":9},null,49,null,"P(",{"$f":"AE15+1","v":4},")","=",{"$f":"INDEX($G$55:$G$103,AE17)","v":5},"≅",null,{"$f":"AH17/AH18","v":0.10204081632653061}]
[null,null,null,null,null,null,null,null,null,null,null,null,null,null,null,null,null,null,null,null,null,null,null,null,null,null,null,null,null,null,null,null,null,{"$f":"$J$3","v":49}]
[null,null,null,null,false]
[null,null,null,null,null,null,null,null,null,null,null,null,null,null,null,null,null,null,null,null,null,null,null,null,null,null,null,null,null,"Ereignisse ( = Teilmengen von Ω):"]
[]
[null,null,null,null,null,null,null,null,null,null,null,null,null,null,null,null,null,null,null,null,null,null,null,null,null,null,null,null,null,null,"A",":","Es wird eine Zahl aus dem abgeschlossenen Intervall [",null,null,null,null,null,null,null,null,null,null,2,";",6,"] gezogen."]
[]
[null,null,null,null,null,null,null,null,null,null,null,null,null,null,null,null,null,null,null,null,null,null,null,null,null,null,null,null,null,null,"B",":","Es wird eine Zahl aus dem abgeschlossenen Intervall [",null,null,null,null,null,null,null,null,null,null,4,";",7,"] gezogen."]
[]
[null,null,null,null,null,null,null,null,null,null,null,null,null,null,null,null,null,null,null,null,null,null,null,null,null,null,null,null,null," A ∪ B",null,":",{"$f":"CONCATENATE(\"Es wird eine Zahl aus dem Intervall [ \",AR22,\" ; \",AT22,\" ] ODER dem Intervall [ \",AR24,\" ; \",AT24,\" ] gezogen.\")","v":"Es wird eine Zahl aus dem Intervall [ 2 ; 6 ] ODER dem Intervall [ 4 ; 7 ] gezogen."}]
[null,null,null,null,null,null,null,null,null,null,null,null,null,null,null,null,null,null,null,null,null,null,null,null,null,null,null,null,null,null,null,null,null,null,null,null,null,null,null,null,null,{"$f":"MAX(AR22,AR24)","v":4},null,{"$f":"MIN(AT22,AT24)","v":6}]
[null,null,null,null,null,null,null,null,null,null,null,null,null,null,null,null,null,null,null,null,null,null,null,null,null,null,null,null,null,null,"A ∩ B",":",{"$f":"IF(AP27>AR27,CONCATENATE(\"Es ist nicht möglich eine Zahl zu ziehen, die im Intervall [ \",AR22,\" ; \",AT22,\" ] UND im Intervall [ \",AR24,\" ; \",AT24,\" ] liegt.\"),CONCATENATE(\"Es wird eine Zahl aus dem Intervall [ \",AP27,\" ; \",AR27,\" ] gezogen.\"))","v":"Es wird eine Zahl aus dem Intervall [ 4 ; 6 ] gezogen."}]
[]
[null,null,null,null,null,null,null,null,null,null,null,null,null,null,null,null,null,null,null,null,null,null,null,null,null,null,null,null,null,"P(A)",null,null,"≅",{"$f":"IF(AR22<=AT22,SUM(INDIRECT(\"z\"&ROW($Z$55)+AR22-1):INDIRECT(\"z\"&ROW($Z$55)+AT22-1)),0)","v":0.61224489795918369}]
[]
[null,null,null,null,null,null,null,null,null,null,null,null,null,null,null,null,null,null,null,null,null,null,null,null,null,null,null,null,null,"P(B)",null,null,"≅",{"$f":"IF(AR24<=AT24,SUM(INDIRECT(\"z\"&ROW($Z$55)+AR24-1):INDIRECT(\"z\"&ROW($Z$55)+AT24-1)),0)","v":0.53061224489795911}]
[]
[null,null,null,null,null,null,null,null,null,null,null,null,null,null,null,null,null,null,null,null,null,null,null,null,null,null,null,null,null,"P(A ∩ B)",null,null,"≅",{"$f":"IF(AP27<=AR27,SUM(INDIRECT(\"z\"&ROW($Z$55)+AP27-1):INDIRECT(\"z\"&ROW($Z$55)+AR27-1)),0)","v":0.38775510204081631}]
[]
[null,null,null,null,null,null,null,null,null,null,null,null,null,null,null,null,null,null,null,null,null,null,null,null,null,null,null,null,null,"P(A ∪ B)",null,null,"≅","P(A)",null,null,"+","P(B)","-","P(A ∩ B)"]
[]
[null,null,null,null,null,null,null,null,null,null,null,null,null,null,null,null,null,null,null,null,null,null,null,null,null,null,null,null,null,null,null,null,"≅",{"$f":"AH30","v":0.61224489795918369},null,null,"+",{"$f":"AH32","v":0.53061224489795911},"-",{"$f":"AH34","v":0.38775510204081631},"≅",{"$f":"ROUND(AH38+AL38-AN38,4)","v":0.75509999999999999}]
[]
[]
[]
[]
[]
[null,"Anzahl Farben:"]
[]
[null,null,"rot",null,null,null,{"$f":"COUNTIF(Kugeln!$Y$4:$Z$52,Ergebnismenge!C30)","v":6},null,null,null,null,null,null,null,{"$f":"IF(G46>0,C46,\"\")","v":"rot"},null,null,null,null,null,null,{"$f":"CONCATENATE(N46,O46)","v":"rot"}]
[null,null,"grün",null,null,null,{"$f":"COUNTIF(Kugeln!$Y$4:$Z$52,Ergebnismenge!C31)","v":15},null,null,null,null,null,null,{"$f":"IF(AND(SUM($G$46:G46)>0,G47>0),\", \",\"\")","v":", "},{"$f":"IF(G47>0,C47,\"\")","v":"grün"},null,null,null,null,null,null,{"$f":"CONCATENATE(N47,O47)","v":", grün"}]
[null,null,"blau",null,null,null,{"$f":"COUNTIF(Kugeln!$Y$4:$Z$52,Ergebnismenge!C32)","v":7},null,null,null,null,null,null,{"$f":"IF(AND(SUM($G$46:G47)>0,G48>0),\", \",\"\")","v":", "},{"$f":"IF(G48>0,C48,\"\")","v":"blau"},null,null,null,null,null,null,", blau"]
[null,null,"gelb",null,null,null,{"$f":"COUNTIF(Kugeln!$Y$4:$Z$52,Ergebnismenge!C33)","v":9},null,null,null,null,null,null,{"$f":"IF(AND(SUM($G$46:G48)>0,G49>0),\", \",\"\")","v":", "},{"$f":"IF(G49>0,C49,\"\")","v":"gelb"},null,null,null,null,null,null,", gelb"]
[null,null,"grau",null,null,null,{"$f":"COUNTIF(Kugeln!$Y$4:$Z$52,Ergebnismenge!C34)","v":12},null,null,null,null,null,null,{"$f":"IF(AND(SUM($G$46:G49)>0,G50>0),\", \",\"\")","v":", "},{"$f":"IF(G50>0,C50,\"\")","v":"grau"},null,null,null,null,null,null,", grau"]
[null,null,"|Ω| =",null,null,null,{"$f":"COUNTIF(G46:G50,\">0\")","v":5}]
[]
[null,"Anzahl Zahlen:"]
[]
[null,null,1,null,null,null,{"$f":"COUNTIF(Kugeln!$Y$4:$Z$52,Ergebnismenge!C39)","v":0},null,null,null,null,null,null,null,{"$f":"IF(G55>0,C55,\"\")","v":""},null,null,null,null,null,null,"",null,null,null,{"$f":"G55/$J$3","v":0}]
[null,null,2,null,null,null,{"$f":"COUNTIF(Kugeln!$Y$4:$Z$52,Ergebnismenge!C40)","v":8},null,null,null,null,null,null,{"$f":"IF(AND(SUM($G$55:G55)>0,G56>0),\", \",\"\")","v":""},2,null,null,null,null,null,null,"2",null,null,null,{"$f":"G56/$J$3","v":0.16326530612244897}]
[null,null,3,null,null,null,{"$f":"COUNTIF(Kugeln!$Y$4:$Z$52,Ergebnismenge!C41)","v":3},null,null,null,null,null,null,{"$f":"IF(AND(SUM($G$55:G56)>0,G57>0),\", \",\"\")","v":", "},3,null,null,null,null,null,null,", 3",null,null,null,6.1224489795918366E-2]
[null,null,4,null,null,null,{"$f":"COUNTIF(Kugeln!$Y$4:$Z$52,Ergebnismenge!C42)","v":5},null,null,null,null,null,null,{"$f":"IF(AND(SUM($G$55:G57)>0,G58>0),\", \",\"\")","v":", "},4,null,null,null,null,null,null,", 4",null,null,null,0.10204081632653061]
[null,null,5,null,null,null,{"$f":"COUNTIF(Kugeln!$Y$4:$Z$52,Ergebnismenge!C43)","v":7},null,null,null,null,null,null,{"$f":"IF(AND(SUM($G$55:G58)>0,G59>0),\", \",\"\")","v":", "},5,null,null,null,null,null,null,", 5",null,null,null,0.14285714285714285]
[null,null,6,null,null,null,{"$f":"COUNTIF(Kugeln!$Y$4:$Z$52,Ergebnismenge!C44)","v":7},null,null,null,null,null,null,{"$f":"IF(AND(SUM($G$55:G59)>0,G60>0),\", \",\"\")","v":", "},6,null,null,null,null,null,null,", 6",null,null,null,0.14285714285714285]
[null,null,7,null,null,null,{"$f":"COUNTIF(Kugeln!$Y$4:$Z$52,Ergebnismenge!C45)","v":7},null,null,null,null,null,null,{"$f":"IF(AND(SUM($G$55:G60)>0,G61>0),\", \",\"\")","v":", "},7,null,null,null,null,null,null,", 7",null,null,null,0.14285714285714285]
[null,null,8,null,null,null,{"$f":"COUNTIF(Kugeln!$Y$4:$Z$52,Ergebnismenge!C46)","v":6},null,null,null,null,null,null,{"$f":"IF(AND(SUM($G$55:G61)>0,G62>0),\", \",\"\")","v":", "},8,null,null,null,null,null,null,", 8",null,null,null,0.12244897959183673]
[null,null,9,null,null,null,{"$f":"COUNTIF(Kugeln!$Y$4:$Z$52,Ergebnismenge!C47)","v":6},null,null,null,null,null,null,{"$f":"IF(AND(SUM($G$55:G62)>0,G63>0),\", \",\"\")","v":", "},9,null,null,null,null,null,null,", 9",null,null,null,0.12244897959183673]
[null,null,10,null,null,null,{"$f":"COUNTIF(Kugeln!$Y$4:$Z$52,Ergebnismenge!C48)","v":0},null,null,null,null,null,null,{"$f":"IF(AND(SUM($G$55:G63)>0,G64>0),\", \",\"\")","v":""},"",null,null,null,null,null,null,"",null,null,null,0]
[null,null,11,null,null,null,{"$f":"COUNTIF(Kugeln!$Y$4:$Z$52,Ergebnismenge!C49)","v":0},null,null,null,null,null,null,{"$f":"IF(AND(SUM($G$55:G64)>0,G65>0),\", \",\"\")","v":""},"",null,null,null,null,null,null,"",null,null,null,0]
[null,null,12,null,null,null,{"$f":"COUNTIF(Kugeln!$Y$4:$Z$52,Ergebnismenge!C50)","v":0},null,null,null,null,null,null,{"$f":"IF(AND(SUM($G$55:G65)>0,G66>0),\", \",\"\")","v":""},"",null,null,null,null,null,null,"",null,null,null,0]
[null,null,13,null,null,null,{"$f":"COUNTIF(Kugeln!$Y$4:$Z$52,Ergebnismenge!C51)","v":0},null,null,null,null,null,null,{"$f":"IF(AND(SUM($G$55:G66)>0,G67>0),\", \",\"\")","v":""},"",null,null,null,null,null,null,"",null,null,null,0]
[null,null,14,null,null,null,{"$f":"COUNTIF(Kugeln!$Y$4:$Z$52,Ergebnismenge!C52)","v":0},null,null,null,null,null,null,{"$f":"IF(AND(SUM($G$55:G67)>0,G68>0),\", \",\"\")","v":""},"",null,null,null,null,null,null,"",null,null,null,0]
[null,null,15,null,null,null,{"$f":"COUNTIF(Kugeln!$Y$4:$Z$52,Ergebnismenge!C53)","v":0},null,null,null,null,null,null,{"$f":"IF(AND(SUM($G$55:G68)>0,G69>0),\", \",\"\")","v":""},"",null,null,null,null,null,null,"",null,null,null,0]
[null,null,16,null,null,null,{"$f":"COUNTIF(Kugeln!$Y$4:$Z$52,Ergebnismenge!C54)","v":0},null,null,null,null,null,null,{"$f":"IF(AND(SUM($G$55:G69)>0,G70>0),\", \",\"\")","v":""},"",null,null,null,null,null,null,"",null,null,null,0]
[null,null,17,null,null,null,{"$f":"COUNTIF(Kugeln!$Y$4:$Z$52,Ergebnismenge!C55)","v":0},null,null,null,null,null,null,{"$f":"IF(AND(SUM($G$55:G70)>0,G71>0),\", \",\"\")","v":""},"",null,null,null,null,null,null,"",null,null,null,0]
[null,null,18,null,null,null,{"$f":"COUNTIF(Kugeln!$Y$4:$Z$52,Ergebnismenge!C56)","v":0},null,null,null,null,null,null,{"$f":"IF(AND(SUM($G$55:G71)>0,G72>0),\", \",\"\")","v":""},"",null,null,null,null,null,null,"",null,null,null,0]
[null,null,19,null,null,null,{"$f":"COUNTIF(Kugeln!$Y$4:$Z$52,Ergebnismenge!C57)","v":0},null,null,null,null,null,null,{"$f":"IF(AND(SUM($G$55:G72)>0,G73>0),\", \",\"\")","v":""},"",null,null,null,null,null,null,"",null,null,null,0]
[null,null,20,null,null,null,{"$f":"COUNTIF(Kugeln!$Y$4:$Z$52,Ergebnismenge!C58)","v":0},null,null,null,null,null,null,{"$f":"IF(AND(SUM($G$55:G73)>0,G74>0),\", \",\"\")","v":""},"",null,null,null,null,null,null,"",null,null,null,0]
[null,null,21,null,null,null,{"$f":"COUNTIF(Kugeln!$Y$4:$Z$52,Ergebnismenge!C59)","v":0},null,null,null,null,null,null,{"$f":"IF(AND(SUM($G$55:G74)>0,G75>0),\", \",\"\")","v":""},"",null,null,null,null,null,null,"",null,null,null,0]
[null,null,22,null,null,null,{"$f":"COUNTIF(Kugeln!$Y$4:$Z$52,Ergebnismenge!C60)","v":0},null,null,null,null,null,null,{"$f":"IF(AND(SUM($G$55:G75)>0,G76>0),\", \",\"\")","v":""},"",null,null,null,null,null,null,"",null,null,null,0]
[null,null,23,null,null,null,{"$f":"COUNTIF(Kugeln!$Y$4:$Z$52,Ergebnismenge!C61)","v":0},null,null,null,null,null,null,{"$f":"IF(AND(SUM($G$55:G76)>0,G77>0),\", \",\"\")","v":""},"",null,null,null,null,null,null,"",null,null,null,0]
[null,null,24,null,null,null,{"$f":"COUNTIF(Kugeln!$Y$4:$Z$52,Ergebnismenge!C62)","v":0},null,null,null,null,null,null,{"$f":"IF(AND(SUM($G$55:G77)>0,G78>0),\", \",\"\")","v":""},"",null,null,null,null,null,null,"",null,null,null,0]
[null,null,25,null,null,null,{"$f":"COUNTIF(Kugeln!$Y$4:$Z$52,Ergebnismenge!C63)","v":0},null,null,null,null,null,null,{"$f":"IF(AND(SUM($G$55:G78)>0,G79>0),\", \",\"\")","v":""},"",null,null,null,null,null,null,"",null,null,null,0]
[null,null,26,null,null,null,{"$f":"COUNTIF(Kugeln!$Y$4:$Z$52,Ergebnismenge!C64)","v":0},null,null,null,null,null,null,{"$f":"IF(AND(SUM($G$55:G79)>0,G80>0),\", \",\"\")","v":""},"",null,null,null,null,null,null,"",null,null,null,0]
[null,null,27,null,null,null,{"$f":"COUNTIF(Kugeln!$Y$4:$Z$52,Ergebnismenge!C65)","v":0},null,null,null,null,null,null,{"$f":"IF(AND(SUM($G$55:G80)>0,G81>0),\", \",\"\")","v":""},"",null,null,null,null,null,null,"",null,null,null,0]
[null,null,28,null,null,null,{"$f":"COUNTIF(Kugeln!$Y$4:$Z$52,Ergebnismenge!C66)","v":0},null,null,null,null,null,null,{"$f":"IF(AND(SUM($G$55:G81)>0,G82>0),\", \",\"\")","v":""},"",null,null,null,null,null,null,"",null,null,null,0]
[null,null,29,null,null,null,{"$f":"COUNTIF(Kugeln!$Y$4:$Z$52,Ergebnismenge!C67)","v":0},null,null,null,null,null,null,{"$f":"IF(AND(SUM($G$55:G82)>0,G83>0),\", \",\"\")","v":""},"",null,null,null,null,null,null,"",null,null,null,0]
[null,null,30,null,null,null,{"$f":"COUNTIF(Kugeln!$Y$4:$Z$52,Ergebnismenge!C68)","v":0},null,null,null,null,null,null,{"$f":"IF(AND(SUM($G$55:G83)>0,G84>0),\", \",\"\")","v":""},"",null,null,null,null,null,null,"",null,null,null,0]
[null,null,31,null,null,null,{"$f":"COUNTIF(Kugeln!$Y$4:$Z$52,Ergebnismenge!C69)","v":0},null,null,null,null,null,null,{"$f":"IF(AND(SUM($G$55:G84)>0,G85>0),\", \",\"\")","v":""},"",null,null,null,null,null,null,"",null,null,null,0]
[null,null,32,null,null,null,{"$f":"COUNTIF(Kugeln!$Y$4:$Z$52,Ergebnismenge!C70)","v":0},null,null,null,null,null,null,{"$f":"IF(AND(SUM($G$55:G85)>0,G86>0),\", \",\"\")","v":""},"",null,null,null,null,null,null,"",null,null,null,0]
[null,null,33,null,null,null,{"$f":"COUNTIF(Kugeln!$Y$4:$Z$52,Ergebnismenge!C71)","v":0},null,null,null,null,null,null,{"$f":"IF(AND(SUM($G$55:G86)>0,G87>0),\", \",\"\")","v":""},"",null,null,null,null,null,null,"",null,null,null,0]
[null,null,34,null,null,null,{"$f":"COUNTIF(Kugeln!$Y$4:$Z$52,Ergebnismenge!C72)","v":0},null,null,null,null,null,null,{"$f":"IF(AND(SUM($G$55:G87)>0,G88>0),\", \",\"\")","v":""},"",null,null,null,null,null,null,"",null,null,null,0]
[null,null,35,null,null,null,{"$f":"COUNTIF(Kugeln!$Y$4:$Z$52,Ergebnismenge!C73)","v":0},null,null,null,null,null,null,{"$f":"IF(AND(SUM($G$55:G88)>0,G89>0),\", \",\"\")","v":""},"",null,null,null,null,null,null,"",null,null,null,0]
[null,null,36,null,null,null,{"$f":"COUNTIF(Kugeln!$Y$4:$Z$52,Ergebnismenge!C74)","v":0},null,null,null,null,null,null,{"$f":"IF(AND(SUM($G$55:G89)>0,G90>0),\", \",\"\")","v":""},"",null,null,null,null,null,null,"",null,null,null,0]
[null,null,37,null,null,null,{"$f":"COUNTIF(Kugeln!$Y$4:$Z$52,Ergebnismenge!C75)","v":0},null,null,null,null,null,null,{"$f":"IF(AND(SUM($G$55:G90)>0,G91>0),\", \",\"\")","v":""},"",null,null,null,null,null,null,"",null,null,null,0]
[null,null,38,null,null,null,{"$f":"COUNTIF(Kugeln!$Y$4:$Z$52,Ergebnismenge!C76)","v":0},null,null,null,null,null,null,{"$f":"IF(AND(SUM($G$55:G91)>0,G92>0),\", \",\"\")","v":""},"",null,null,null,null,null,null,"",null,null,null,0]
[null,null,39,null,null,null,{"$f":"COUNTIF(Kugeln!$Y$4:$Z$52,Ergebnismenge!C77)","v":0},null,null,null,null,null,null,{"$f":"IF(AND(SUM($G$55:G92)>0,G93>0),\", \",\"\")","v":""},"",null,null,null,null,null,null,"",null,null,null,0]
[null,null,40,null,null,null,{"$f":"COUNTIF(Kugeln!$Y$4:$Z$52,Ergebnismenge!C78)","v":0},null,null,null,null,null,null,{"$f":"IF(AND(SUM($G$55:G93)>0,G94>0),\", \",\"\")","v":""},"",null,null,null,null,null,null,"",null,null,null,0]
[null,null,41,null,null,null,{"$f":"COUNTIF(Kugeln!$Y$4:$Z$52,Ergebnismenge!C79)","v":0},null,null,null,null,null,null,{"$f":"IF(AND(SUM($G$55:G94)>0,G95>0),\", \",\"\")","v":""},"",null,null,null,null,null,null,"",null,null,null,0]
[null,null,42,null,null,null,{"$f":"COUNTIF(Kugeln!$Y$4:$Z$52,Ergebnismenge!C80)","v":0},null,null,null,null,null,null,{"$f":"IF(AND(SUM($G$55:G95)>0,G96>0),\", \",\"\")","v":""},"",null,null,null,null,null,null,"",null,null,null,0]
[null,null,43,null,null,null,{"$f":"COUNTIF(Kugeln!$Y$4:$Z$52,Ergebnismenge!C81)","v":0},null,null,null,null,null,null,{"$f":"IF(AND(SUM($G$55:G96)>0,G97>0),\", \",\"\")","v":""},"",null,null,null,null,null,null,"",null,null,null,0]
[null,null,44,null,null,null,{"$f":"COUNTIF(Kugeln!$Y$4:$Z$52,Ergebnismenge!C82)","v":0},null,null,null,null,null,null,{"$f":"IF(AND(SUM($G$55:G97)>0,G98>0),\", \",\"\")","v":""},"",null,null,null,null,null,null,"",null,null,null,0]
[null,null,45,null,null,null,{"$f":"COUNTIF(Kugeln!$Y$4:$Z$52,Ergebnismenge!C83)","v":0},null,null,null,null,null,null,{"$f":"IF(AND(SUM($G$55:G98)>0,G99>0),\", \",\"\")","v":""},"",null,null,null,null,null,null,"",null,null,null,0]
[null,null,46,null,null,null,{"$f":"COUNTIF(Kugeln!$Y$4:$Z$52,Ergebnismenge!C84)","v":0},null,null,null,null,null,null,{"$f":"IF(AND(SUM($G$55:G99)>0,G100>0),\", \",\"\")","v":""},"",null,null,null,null,null,null,"",null,null,null,0]
[null,null,47,null,null,null,{"$f":"COUNTIF(Kugeln!$Y$4:$Z$52,Ergebnismenge!C85)","v":0},null,null,null,null,null,null,{"$f":"IF(AND(SUM($G$55:G100)>0,G101>0),\", \",\"\")","v":""},"",null,null,null,null,null,null,"",null,null,null,0]
[null,null,48,null,null,null,{"$f":"COUNTIF(Kugeln!$Y$4:$Z$52,Ergebnismenge!C86)","v":0},null,null,null,null,null,null,{"$f":"IF(AND(SUM($G$55:G101)>0,G102>0),\", \",\"\")","v":""},"",null,null,null,null,null,null,"",null,null,null,0]
[null,null,49,null,null,null,{"$f":"COUNTIF(Kugeln!$Y$4:$Z$52,Ergebnismenge!C87)","v":0},null,null,null,null,null,null,{"$f":"IF(AND(SUM($G$55:G102)>0,G103>0),\", \",\"\")","v":""},"",null,null,null,null,null,null,"",null,null,null,0]
[null,null,"|Ω| =",null,null,null,{"$f":"COUNTIF(G55:G103,\">0\")","v":8}]
[]
[null,"Anzahl (Zahl, Farbe):"]
[]
[null,null,1,null,null,"rot",{"$f":"COUNTIF(Kugeln!$X$4:$X$52,CONCATENATE(\"(\",Ergebnismenge!C92,\", \",F108,\")\"))","v":0},null,null,null,null,null,null,null,{"$f":"IF(G108>0,CONCATENATE(\"(\",F108,\", \",C108,\")\"),\"\")","v":""},null,null,null,null,null,null,""]
[null,null,2,null,null,"rot",{"$f":"COUNTIF(Kugeln!$X$4:$X$52,CONCATENATE(\"(\",Ergebnismenge!C93,\", \",F109,\")\"))","v":1},null,null,null,null,null,null,{"$f":"IF(AND(SUM($G$108:G108)>0,G109>0),\", \",\"\")","v":""},"(rot, 2)",null,null,null,null,null,null,"(rot, 2)"]
[null,null,3,null,null,"rot",{"$f":"COUNTIF(Kugeln!$X$4:$X$52,CONCATENATE(\"(\",Ergebnismenge!C94,\", \",F110,\")\"))","v":0},null,null,null,null,null,null,{"$f":"IF(AND(SUM($G$108:G109)>0,G110>0),\", \",\"\")","v":""},{"$f":"IF(G110>0,CONCATENATE(\"(\",F110,\", \",C110,\")\"),\"\")","v":""},null,null,null,null,null,null,""]
[null,null,4,null,null,"rot",{"$f":"COUNTIF(Kugeln!$X$4:$X$52,CONCATENATE(\"(\",Ergebnismenge!C95,\", \",F111,\")\"))","v":1},null,null,null,null,null,null,{"$f":"IF(AND(SUM($G$108:G110)>0,G111>0),\", \",\"\")","v":", "},{"$f":"IF(G111>0,CONCATENATE(\"(\",F111,\", \",C111,\")\"),\"\")","v":"(rot, 4)"},null,null,null,null,null,null,", (rot, 4)"]
[null,null,5,null,null,"rot",{"$f":"COUNTIF(Kugeln!$X$4:$X$52,CONCATENATE(\"(\",Ergebnismenge!C96,\", \",F112,\")\"))","v":0},null,null,null,null,null,null,{"$f":"IF(AND(SUM($G$108:G111)>0,G112>0),\", \",\"\")","v":""},"",null,null,null,null,null,null,""]
[null,null,6,null,null,"rot",{"$f":"COUNTIF(Kugeln!$X$4:$X$52,CONCATENATE(\"(\",Ergebnismenge!C97,\", \",F113,\")\"))","v":2},null,null,null,null,null,null,{"$f":"IF(AND(SUM($G$108:G112)>0,G113>0),\", \",\"\")","v":", "},"(rot, 6)",null,null,null,null,null,null,{"$f":"CONCATENATE(N113,O113)","v":", (rot, 6)"}]
[null,null,7,null,null,"rot",{"$f":"COUNTIF(Kugeln!$X$4:$X$52,CONCATENATE(\"(\",Ergebnismenge!C98,\", \",F114,\")\"))","v":1},null,null,null,null,null,null,{"$f":"IF(AND(SUM($G$108:G113)>0,G114>0),\", \",\"\")","v":", "},"(rot, 7)",null,null,null,null,null,null,", (rot, 7)"]
[null,null,8,null,null,"rot",{"$f":"COUNTIF(Kugeln!$X$4:$X$52,CONCATENATE(\"(\",Ergebnismenge!C99,\", \",F115,\")\"))","v":1},null,null,null,null,null,null,{"$f":"IF(AND(SUM($G$108:G114)>0,G115>0),\", \",\"\")","v":", "},"(rot, 8)",null,null,null,null,null,null,", (rot, 8)"]
[null,null,9,null,null,"rot",{"$f":"COUNTIF(Kugeln!$X$4:$X$52,CONCATENATE(\"(\",Ergebnismenge!C100,\", \",F116,\")\"))","v":0},null,null,null,null,null,null,{"$f":"IF(AND(SUM($G$108:G115)>0,G116>0),\", \",\"\")","v":""},"",null,null,null,null,null,null,""]
[null,null,10,null,null,"rot",{"$f":"COUNTIF(Kugeln!$X$4:$X$52,CONCATENATE(\"(\",Ergebnismenge!C101,\", \",F117,\")\"))","v":0},null,null,null,null,null,null,{"$f":"IF(AND(SUM($G$108:G116)>0,G117>0),\", \",\"\")","v":""},"",null,null,null,null,null,null,""]
[null,null,11,null,null,"rot",{"$f":"COUNTIF(Kugeln!$X$4:$X$52,CONCATENATE(\"(\",Ergebnismenge!C102,\", \",F118,\")\"))","v":0},null,null,null,null,null,null,{"$f":"IF(AND(SUM($G$108:G117)>0,G118>0),\", \",\"\")","v":""},"",null,null,null,null,null,null,""]
[null,null,12,null,null,"rot",{"$f":"COUNTIF(Kugeln!$X$4:$X$52,CONCATENATE(\"(\",Ergebnismenge!C103,\", \",F119,\")\"))","v":0},null,null,null,null,null,null,{"$f":"IF(AND(SUM($G$108:G118)>0,G119>0),\", \",\"\")","v":""},"",null,null,null,null,null,null,""]
[null,null,13,null,null,"rot",{"$f":"COUNTIF(Kugeln!$X$4:$X$52,CONCATENATE(\"(\",Ergebnismenge!C104,\", \",F120,\")\"))","v":0},null,null,null,null,null,null,{"$f":"IF(AND(SUM($G$108:G119)>0,G120>0),\", \",\"\")","v":""},"",null,null,null,null,null,null,""]
[null,null,14,null,null,"rot",{"$f":"COUNTIF(Kugeln!$X$4:$X$52,CONCATENATE(\"(\",Ergebnismenge!C105,\", \",F121,\")\"))","v":0},null,null,null,null,null,null,{"$f":"IF(AND(SUM($G$108:G120)>0,G121>0),\", \",\"\")","v":""},"",null,null,null,null,null,null,""]
[null,null,15,null,null,"rot",{"$f":"COUNTIF(Kugeln!$X$4:$X$52,CONCATENATE(\"(\",Ergebnismenge!C106,\", \",F122,\")\"))","v":0},null,null,null,null,null,null,{"$f":"IF(AND(SUM($G$108:G121)>0,G122>0),\", \",\"\")","v":""},"",null,null,null,null,null,null,""]
[null,null,16,null,null,"rot",{"$f":"COUNTIF(Kugeln!$X$4:$X$52,CONCATENATE(\"(\",Ergebnismenge!C107,\", \",F123,\")\"))","v":0},null,null,null,null,null,null,{"$f":"IF(AND(SUM($G$108:G122)>0,G123>0),\", \",\"\")","v":""},"",null,null,null,null,null,null,""]
[null,null,17,null,null,"rot",{"$f":"COUNTIF(Kugeln!$X$4:$X$52,CONCATENATE(\"(\",Ergebnismenge!C108,\", \",F124,\")\"))","v":0},null,null,null,null,null,null,{"$f":"IF(AND(SUM($G$108:G123)>0,G124>0),\", \",\"\")","v":""},"",null,null,null,null,null,null,""]
[null,null,18,null,null,"rot",{"$f":"COUNTIF(Kugeln!$X$4:$X$52,CONCATENATE(\"(\",Ergebnismenge!C109,\", \",F125,\")\"))","v":0},null,null,null,null,null,null,{"$f":"IF(AND(SUM($G$108:G124)>0,G125>0),\", \",\"\")","v":""},"",null,null,null,null,null,null,""]
[null,null,19,null,null,"rot",{"$f":"COUNTIF(Kugeln!$X$4:$X$52,CONCATENATE(\"(\",Ergebnismenge!C110,\", \",F126,\")\"))","v":0},null,null,null,null,null,null,{"$f":"IF(AND(SUM($G$108:G125)>0,G126>0),\", \",\"\")","v":""},"",null,null,null,null,null,null,""]
[null,null,20,null,null,"rot",{"$f":"COUNTIF(Kugeln!$X$4:$X$52,CONCATENATE(\"(\",Ergebnismenge!C111,\", \",F127,\")\"))","v":0},null,null,null,null,null,null,{"$f":"IF(AND(SUM($G$108:G126)>0,G127>0),\", \",\"\")","v":""},"",null,null,null,null,null,null,""]
[null,null,21,null,null,"rot",{"$f":"COUNTIF(Kugeln!$X$4:$X$52,CONCATENATE(\"(\",Ergebnismenge!C112,\", \",F128,\")\"))","v":0},null,null,null,null,null,null,{"$f":"IF(AND(SUM($G$108:G127)>0,G128>0),\", \",\"\")","v":""},"",null,null,null,null,null,null,""]
[null,null,22,null,null,"rot",{"$f":"COUNTIF(Kugeln!$X$4:$X$52,CONCATENATE(\"(\",Ergebnismenge!C113,\", \",F129,\")\"))","v":0},null,null,null,null,null,null,{"$f":"IF(AND(SUM($G$108:G128)>0,G129>0),\", \",\"\")","v":""},"",null,null,null,null,null,null,""]
[null,null,23,null,null,"rot",{"$f":"COUNTIF(Kugeln!$X$4:$X$52,CONCATENATE(\"(\",Ergebnismenge!C114,\", \",F130,\")\"))","v":0},null,null,null,null,null,null,{"$f":"IF(AND(SUM($G$108:G129)>0,G130>0),\", \",\"\")","v":""},"",null,null,null,null,null,null,""]
[null,null,24,null,null,"rot",{"$f":"COUNTIF(Kugeln!$X$4:$X$52,CONCATENATE(\"(\",Ergebnismenge!C115,\", \",F131,\")\"))","v":0},null,null,null,null,null,null,{"$f":"IF(AND(SUM($G$108:G130)>0,G131>0),\", \",\"\")","v":""},"",null,null,null,null,null,null,""]
[null,null,25,null,null,"rot",{"$f":"COUNTIF(Kugeln!$X$4:$X$52,CONCATENATE(\"(\",Ergebnismenge!C116,\", \",F132,\")\"))","v":0},null,null,null,null,null,null,{"$f":"IF(AND(SUM($G$108:G131)>0,G132>0),\", \",\"\")","v":""},"",null,null,null,null,null,null,""]
[null,null,26,null,null,"rot",{"$f":"COUNTIF(Kugeln!$X$4:$X$52,CONCATENATE(\"(\",Ergebnismenge!C117,\", \",F133,\")\"))","v":0},null,null,null,null,null,null,{"$f":"IF(AND(SUM($G$108:G132)>0,G133>0),\", \",\"\")","v":""},"",null,null,null,null,null,null,""]
[null,null,27,null,null,"rot",{"$f":"COUNTIF(Kugeln!$X$4:$X$52,CONCATENATE(\"(\",Ergebnismenge!C118,\", \",F134,\")\"))","v":0},null,null,null,null,null,null,{"$f":"IF(AND(SUM($G$108:G133)>0,G134>0),\", \",\"\")","v":""},"",null,null,null,null,null,null,""]
[null,null,28,null,null,"rot",{"$f":"COUNTIF(Kugeln!$X$4:$X$52,CONCATENATE(\"(\",Ergebnismenge!C119,\", \",F135,\")\"))","v":0},null,null,null,null,null,null,{"$f":"IF(AND(SUM($G$108:G134)>0,G135>0),\", \",\"\")","v":""},"",null,null,null,null,null,null,""]
[null,null,29,null,null,"rot",{"$f":"COUNTIF(Kugeln!$X$4:$X$52,CONCATENATE(\"(\",Ergebnismenge!C120,\", \",F136,\")\"))","v":0},null,null,null,null,null,null,{"$f":"IF(AND(SUM($G$108:G135)>0,G136>0),\", \",\"\")","v":""},"",null,null,null,null,null,null,""]
[null,null,30,null,null,"rot",{"$f":"COUNTIF(Kugeln!$X$4:$X$52,CONCATENATE(\"(\",Ergebnismenge!C121,\", \",F137,\")\"))","v":0},null,null,null,null,null,null,{"$f":"IF(AND(SUM($G$108:G136)>0,G137>0),\", \",\"\")","v":""},"",null,null,null,null,null,null,""]
[null,null,31,null,null,"rot",{"$f":"COUNTIF(Kugeln!$X$4:$X$52,CONCATENATE(\"(\",Ergebnismenge!C122,\", \",F138,\")\"))","v":0},null,null,null,null,null,null,{"$f":"IF(AND(SUM($G$108:G137)>0,G138>0),\", \",\"\")","v":""},"",null,null,null,null,null,null,""]
[null,null,32,null,null,"rot",{"$f":"COUNTIF(Kugeln!$X$4:$X$52,CONCATENATE(\"(\",Ergebnismenge!C123,\", \",F139,\")\"))","v":0},null,null,null,null,null,null,{"$f":"IF(AND(SUM($G$108:G138)>0,G139>0),\", \",\"\")","v":""},"",null,null,null,null,null,null,""]
[null,null,33,null,null,"rot",{"$f":"COUNTIF(Kugeln!$X$4:$X$52,CONCATENATE(\"(\",Ergebnismenge!C124,\", \",F140,\")\"))","v":0},null,null,null,null,null,null,{"$f":"IF(AND(SUM($G$108:G139)>0,G140>0),\", \",\"\")","v":""},"",null,null,null,null,null,null,""]
[null,null,34,null,null,"rot",{"$f":"COUNTIF(Kugeln!$X$4:$X$52,CONCATENATE(\"(\",Ergebnismenge!C125,\", \",F141,\")\"))","v":0},null,null,null,null,null,null,{"$f":"IF(AND(SUM($G$108:G140)>0,G141>0),\", \",\"\")","v":""},"",null,null,null,null,null,null,""]
[null,null,35,null,null,"rot",{"$f":"COUNTIF(Kugeln!$X$4:$X$52,CONCATENATE(\"(\",Ergebnismenge!C126,\", \",F142,\")\"))","v":0},null,null,null,null,null,null,{"$f":"IF(AND(SUM($G$108:G141)>0,G142>0),\", \",\"\")","v":""},"",null,null,null,null,null,null,""]
[null,null,36,null,null,"rot",{"$f":"COUNTIF(Kugeln!$X$4:$X$52,CONCATENATE(\"(\",Ergebnismenge!C127,\", \",F143,\")\"))","v":0},null,null,null,null,null,null,{"$f":"IF(AND(SUM($G$108:G142)>0,G143>0),\", \",\"\")","v":""},"",null,null,null,null,null,null,""]
[null,null,37,null,null,"rot",{"$f":"COUNTIF(Kugeln!$X$4:$X$52,CONCATENATE(\"(\",Ergebnismenge!C128,\", \",F144,\")\"))","v":0},null,null,null,null,null,null,{"$f":"IF(AND(SUM($G$108:G143)>0,G144>0),\", \",\"\")","v":""},"",null,null,null,null,null,null,""]
[null,null,38,null,null,"rot",{"$f":"COUNTIF(Kugeln!$X$4:$X$52,CONCATENATE(\"(\",Ergebnismenge!C129,\", \",F145,\")\"))","v":0},null,null,null,null,null,null,{"$f":"IF(AND(SUM($G$108:G144)>0,G145>0),\", \",\"\")","v":""},"",null,null,null,null,null,null,""]
[null,null,39,null,null,"rot",{"$f":"COUNTIF(Kugeln!$X$4:$X$52,CONCATENATE(\"(\",Ergebnismenge!C130,\", \",F146,\")\"))","v":0},null,null,null,null,null,null,{"$f":"IF(AND(SUM($G$108:G145)>0,G146>0),\", \",\"\")","v":""},"",null,null,null,null,null,null,""]
[null,null,40,null,null,"rot",{"$f":"COUNTIF(Kugeln!$X$4:$X$52,CONCATENATE(\"(\",Ergebnismenge!C131,\", \",F147,\")\"))","v":0},null,null,null,null,null,null,{"$f":"IF(AND(SUM($G$108:G146)>0,G147>0),\", \",\"\")","v":""},"",null,null,null,null,null,null,""]
[null,null,41,null,null,"rot",{"$f":"COUNTIF(Kugeln!$X$4:$X$52,CONCATENATE(\"(\",Ergebnismenge!C132,\", \",F148,\")\"))","v":0},null,null,null,null,null,null,{"$f":"IF(AND(SUM($G$108:G147)>0,G148>0),\", \",\"\")","v":""},"",null,null,null,null,null,null,""]
[null,null,42,null,null,"rot",{"$f":"COUNTIF(Kugeln!$X$4:$X$52,CONCATENATE(\"(\",Ergebnismenge!C133,\", \",F149,\")\"))","v":0},null,null,null,null,null,null,{"$f":"IF(AND(SUM($G$108:G148)>0,G149>0),\", \",\"\")","v":""},"",null,null,null,null,null,null,""]
[null,null,43,null,null,"rot",{"$f":"COUNTIF(Kugeln!$X$4:$X$52,CONCATENATE(\"(\",Ergebnismenge!C134,\", \",F150,\")\"))","v":0},null,null,null,null,null,null,{"$f":"IF(AND(SUM($G$108:G149)>0,G150>0),\", \",\"\")","v":""},"",null,null,null,null,null,null,""]
[null,null,44,null,null,"rot",{"$f":"COUNTIF(Kugeln!$X$4:$X$52,CONCATENATE(\"(\",Ergebnismenge!C135,\", \",F151,\")\"))","v":0},null,null,null,null,null,null,{"$f":"IF(AND(SUM($G$108:G150)>0,G151>0),\", \",\"\")","v":""},"",null,null,null,null,null,null,""]
[null,null,45,null,null,"rot",{"$f":"COUNTIF(Kugeln!$X$4:$X$52,CONCATENATE(\"(\",Ergebnismenge!C136,\", \",F152,\")\"))","v":0},null,null,null,null,null,null,{"$f":"IF(AND(SUM($G$108:G151)>0,G152>0),\", \",\"\")","v":""},"",null,null,null,null,null,null,""]
[null,null,46,null,null,"rot",{"$f":"COUNTIF(Kugeln!$X$4:$X$52,CONCATENATE(\"(\",Ergebnismenge!C137,\", \",F153,\")\"))","v":0},null,null,null,null,null,null,{"$f":"IF(AND(SUM($G$108:G152)>0,G153>0),\", \",\"\")","v":""},"",null,null,null,null,null,null,""]
[null,null,47,null,null,"rot",{"$f":"COUNTIF(Kugeln!$X$4:$X$52,CONCATENATE(\"(\",Ergebnismenge!C138,\", \",F154,\")\"))","v":0},null,null,null,null,null,null,{"$f":"IF(AND(SUM($G$108:G153)>0,G154>0),\", \",\"\")","v":""},"",null,null,null,null,null,null,""]
[null,null,48,null,null,"rot",{"$f":"COUNTIF(Kugeln!$X$4:$X$52,CONCATENATE(\"(\",Ergebnismenge!C139,\", \",F155,\")\"))","v":0},null,null,null,null,null,null,{"$f":"IF(AND(SUM($G$108:G154)>0,G155>0),\", \",\"\")","v":""},"",null,null,null,null,null,null,""]
[null,null,49,null,null,"rot",{"$f":"COUNTIF(Kugeln!$X$4:$X$52,CONCATENATE(\"(\",Ergebnismenge!C140,\", \",F156,\")\"))","v":0},null,null,null,null,null,null,{"$f":"IF(AND(SUM($G$108:G155)>0,G156>0),\", \",\"\")","v":""},"",null,null,null,null,null,null,""]
[null,null,1,null,null,"grün",{"$f":"COUNTIF(Kugeln!$X$4:$X$52,CONCATENATE(\"(\",Ergebnismenge!C141,\", \",F157,\")\"))","v":0},null,null,null,null,null,null,{"$f":"IF(AND(SUM($G$108:G156)>0,G157>0),\", \",\"\")","v":""},"",null,null,null,null,null,null,""]
[null,null,2,null,null,"grün",{"$f":"COUNTIF(Kugeln!$X$4:$X$52,CONCATENATE(\"(\",Ergebnismenge!C142,\", \",F158,\")\"))","v":2},null,null,null,null,null,null,{"$f":"IF(AND(SUM($G$108:G157)>0,G158>0),\", \",\"\")","v":", "},"(grün, 2)",null,null,null,null,null,null,", (grün, 2)"]
[null,null,3,null,null,"grün",{"$f":"COUNTIF(Kugeln!$X$4:$X$52,CONCATENATE(\"(\",Ergebnismenge!C143,\", \",F159,\")\"))","v":1},null,null,null,null,null,null,{"$f":"IF(AND(SUM($G$108:G158)>0,G159>0),\", \",\"\")","v":", "},"(grün, 3)",null,null,null,null,null,null,", (grün, 3)"]
[null,null,4,null,null,"grün",{"$f":"COUNTIF(Kugeln!$X$4:$X$52,CONCATENATE(\"(\",Ergebnismenge!C144,\", \",F160,\")\"))","v":2},null,null,null,null,null,null,{"$f":"IF(AND(SUM($G$108:G159)>0,G160>0),\", \",\"\")","v":", "},"(grün, 4)",null,null,null,null,null,null,", (grün, 4)"]
[null,null,5,null,null,"grün",{"$f":"COUNTIF(Kugeln!$X$4:$X$52,CONCATENATE(\"(\",Ergebnismenge!C145,\", \",F161,\")\"))","v":1},null,null,null,null,null,null,{"$f":"IF(AND(SUM($G$108:G160)>0,G161>0),\", \",\"\")","v":", "},"(grün, 5)",null,null,null,null,null,null,", (grün, 5)"]
[null,null,6,null,null,"grün",{"$f":"COUNTIF(Kugeln!$X$4:$X$52,CONCATENATE(\"(\",Ergebnismenge!C146,\", \",F162,\")\"))","v":2},null,null,null,null,null,null,{"$f":"IF(AND(SUM($G$108:G161)>0,G162>0),\", \",\"\")","v":", "},"(grün, 6)",null,null,null,null,null,null,", (grün, 6)"]
[null,null,7,null,null,"grün",{"$f":"COUNTIF(Kugeln!$X$4:$X$52,CONCATENATE(\"(\",Ergebnismenge!C147,\", \",F163,\")\"))","v":2},null,null,null,null,null,null,{"$f":"IF(AND(SUM($G$108:G162)>0,G163>0),\", \",\"\")","v":", "},"(grün, 7)",null,null,null,null,null,null,", (grün, 7)"]
[null,null,8,null,null,"grün",{"$f":"COUNTIF(Kugeln!$X$4:$X$52,CONCATENATE(\"(\",Ergebnismenge!C148,\", \",F164,\")\"))","v":3},null,null,null,null,null,null,{"$f":"IF(AND(SUM($G$108:G163)>0,G164>0),\", \",\"\")","v":", "},"(grün, 8)",null,null,null,null,null,null,", (grün, 8)"]
[null,null,9,null,null,"grün",{"$f":"COUNTIF(Kugeln!$X$4:$X$52,CONCATENATE(\"(\",Ergebnismenge!C149,\", \",F165,\")\"))","v":2},null,null,null,null,null,null,{"$f":"IF(AND(SUM($G$108:G164)>0,G165>0),\", \",\"\")","v":", "},"(grün, 9)",null,null,null,null,null,null,", (grün, 9)"]
[null,null,10,null,null,"grün",{"$f":"COUNTIF(Kugeln!$X$4:$X$52,CONCATENATE(\"(\",Ergebnismenge!C150,\", \",F166,\")\"))","v":0},null,null,null,null,null,null,{"$f":"IF(AND(SUM($G$108:G165)>0,G166>0),\", \",\"\")","v":""},"",null,null,null,null,null,null,""]
[null,null,11,null,null,"grün",{"$f":"COUNTIF(Kugeln!$X$4:$X$52,CONCATENATE(\"(\",Ergebnismenge!C151,\", \",F167,\")\"))","v":0},null,null,null,null,null,null,{"$f":"IF(AND(SUM($G$108:G166)>0,G167>0),\", \",\"\")","v":""},"",null,null,null,null,null,null,""]
[null,null,12,null,null,"grün",{"$f":"COUNTIF(Kugeln!$X$4:$X$52,CONCATENATE(\"(\",Ergebnismenge!C152,\", \",F168,\")\"))","v":0},null,null,null,null,null,null,{"$f":"IF(AND(SUM($G$108:G167)>0,G168>0),\", \",\"\")","v":""},"",null,null,null,null,null,null,""]
[null,null,13,null,null,"grün",{"$f":"COUNTIF(Kugeln!$X$4:$X$52,CONCATENATE(\"(\",Ergebnismenge!C153,\", \",F169,\")\"))","v":0},null,null,null,null,null,null,{"$f":"IF(AND(SUM($G$108:G168)>0,G169>0),\", \",\"\")","v":""},"",null,null,null,null,null,null,""]
[null,null,14,null,null,"grün",{"$f":"COUNTIF(Kugeln!$X$4:$X$52,CONCATENATE(\"(\",Ergebnismenge!C154,\", \",F170,\")\"))","v":0},null,null,null,null,null,null,{"$f":"IF(AND(SUM($G$108:G169)>0,G170>0),\", \",\"\")","v":""},"",null,null,null,null,null,null,""]
[null,null,15,null,null,"grün",{"$f":"COUNTIF(Kugeln!$X$4:$X$52,CONCATENATE(\"(\",Ergebnismenge!C155,\", \",F171,\")\"))","v":0},null,null,null,null,null,null,{"$f":"IF(AND(SUM($G$108:G170)>0,G171>0),\", \",\"\")","v":""},"",null,null,null,null,null,null,""]
[null,null,16,null,null,"grün",{"$f":"COUNTIF(Kugeln!$X$4:$X$52,CONCATENATE(\"(\",Ergebnismenge!C156,\", \",F172,\")\"))","v":0},null,null,null,null,null,null,{"$f":"IF(AND(SUM($G$108:G171)>0,G172>0),\", \",\"\")","v":""},"",null,null,null,null,null,null,""]
[null,null,17,null,null,"grün",{"$f":"COUNTIF(Kugeln!$X$4:$X$52,CONCATENATE(\"(\",Ergebnismenge!C157,\", \",F173,\")\"))","v":0},null,null,null,null,null,null,{"$f":"IF(AND(SUM($G$108:G172)>0,G173>0),\", \",\"\")","v":""},"",null,null,null,null,null,null,""]
[null,null,18,null,null,"grün",{"$f":"COUNTIF(Kugeln!$X$4:$X$52,CONCATENATE(\"(\",Ergebnismenge!C158,\", \",F174,\")\"))","v":0},null,null,null,null,null,null,{"$f":"IF(AND(SUM($G$108:G173)>0,G174>0),\", \",\"\")","v":""},"",null,null,null,null,null,null,""]
[null,null,19,null,null,"grün",{"$f":"COUNTIF(Kugeln!$X$4:$X$52,CONCATENATE(\"(\",Ergebnismenge!C159,\", \",F175,\")\"))","v":0},null,null,null,null,null,null,{"$f":"IF(AND(SUM($G$108:G174)>0,G175>0),\", \",\"\")","v":""},{"$f":"IF(G175>0,CONCATENATE(\"(\",F175,\", \",C175,\")\"),\"\")","v":""},null,null,null,null,null,null,""]
[null,null,20,null,null,"grün",{"$f":"COUNTIF(Kugeln!$X$4:$X$52,CONCATENATE(\"(\",Ergebnismenge!C160,\", \",F176,\")\"))","v":0},null,null,null,null,null,null,{"$f":"IF(AND(SUM($G$108:G175)>0,G176>0),\", \",\"\")","v":""},"",null,null,null,null,null,null,""]
[null,null,21,null,null,"grün",{"$f":"COUNTIF(Kugeln!$X$4:$X$52,CONCATENATE(\"(\",Ergebnismenge!C161,\", \",F177,\")\"))","v":0},null,null,null,null,null,null,{"$f":"IF(AND(SUM($G$108:G176)>0,G177>0),\", \",\"\")","v":""},"",null,null,null,null,null,null,{"$f":"CONCATENATE(N177,O177)","v":""}]
[null,null,22,null,null,"grün",{"$f":"COUNTIF(Kugeln!$X$4:$X$52,CONCATENATE(\"(\",Ergebnismenge!C162,\", \",F178,\")\"))","v":0},null,null,null,null,null,null,{"$f":"IF(AND(SUM($G$108:G177)>0,G178>0),\", \",\"\")","v":""},"",null,null,null,null,null,null,""]
[null,null,23,null,null,"grün",{"$f":"COUNTIF(Kugeln!$X$4:$X$52,CONCATENATE(\"(\",Ergebnismenge!C163,\", \",F179,\")\"))","v":0},null,null,null,null,null,null,{"$f":"IF(AND(SUM($G$108:G178)>0,G179>0),\", \",\"\")","v":""},"",null,null,null,null,null,null,""]
[null,null,24,null,null,"grün",{"$f":"COUNTIF(Kugeln!$X$4:$X$52,CONCATENATE(\"(\",Ergebnismenge!C164,\", \",F180,\")\"))","v":0},null,null,null,null,null,null,{"$f":"IF(AND(SUM($G$108:G179)>0,G180>0),\", \",\"\")","v":""},"",null,null,null,null,null,null,""]
[null,null,25,null,null,"grün",{"$f":"COUNTIF(Kugeln!$X$4:$X$52,CONCATENATE(\"(\",Ergebnismenge!C165,\", \",F181,\")\"))","v":0},null,null,null,null,null,null,{"$f":"IF(AND(SUM($G$108:G180)>0,G181>0),\", \",\"\")","v":""},"",null,null,null,null,null,null,""]
[null,null,26,null,null,"grün",{"$f":"COUNTIF(Kugeln!$X$4:$X$52,CONCATENATE(\"(\",Ergebnismenge!C166,\", \",F182,\")\"))","v":0},null,null,null,null,null,null,{"$f":"IF(AND(SUM($G$108:G181)>0,G182>0),\", \",\"\")","v":""},"",null,null,null,null,null,null,""]
[null,null,27,null,null,"grün",{"$f":"COUNTIF(Kugeln!$X$4:$X$52,CONCATENATE(\"(\",Ergebnismenge!C167,\", \",F183,\")\"))","v":0},null,null,null,null,null,null,{"$f":"IF(AND(SUM($G$108:G182)>0,G183>0),\", \",\"\")","v":""},"",null,null,null,null,null,null,""]
[null,null,28,null,null,"grün",{"$f":"COUNTIF(Kugeln!$X$4:$X$52,CONCATENATE(\"(\",Ergebnismenge!C168,\", \",F184,\")\"))","v":0},null,null,null,null,null,null,{"$f":"IF(AND(SUM($G$108:G183)>0,G184>0),\", \",\"\")","v":""},"",null,null,null,null,null,null,""]
[null,null,29,null,null,"grün",{"$f":"COUNTIF(Kugeln!$X$4:$X$52,CONCATENATE(\"(\",Ergebnismenge!C169,\", \",F185,\")\"))","v":0},null,null,null,null,null,null,{"$f":"IF(AND(SUM($G$108:G184)>0,G185>0),\", \",\"\")","v":""},"",null,null,null,null,null,null,""]
[null,null,30,null,null,"grün",{"$f":"COUNTIF(Kugeln!$X$4:$X$52,CONCATENATE(\"(\",Ergebnismenge!C170,\", \",F186,\")\"))","v":0},null,null,null,null,null,null,{"$f":"IF(AND(SUM($G$108:G185)>0,G186>0),\", \",\"\")","v":""},"",null,null,null,null,null,null,""]
[null,null,31,null,null,"grün",{"$f":"COUNTIF(Kugeln!$X$4:$X$52,CONCATENATE(\"(\",Ergebnismenge!C171,\", \",F187,\")\"))","v":0},null,null,null,null,null,null,{"$f":"IF(AND(SUM($G$108:G186)>0,G187>0),\", \",\"\")","v":""},"",null,null,null,null,null,null,""]
[null,null,32,null,null,"grün",{"$f":"COUNTIF(Kugeln!$X$4:$X$52,CONCATENATE(\"(\",Ergebnismenge!C172,\", \",F188,\")\"))","v":0},null,null,null,null,null,null,{"$f":"IF(AND(SUM($G$108:G187)>0,G188>0),\", \",\"\")","v":""},"",null,null,null,null,null,null,""]
[null,null,33,null,null,"grün",{"$f":"COUNTIF(Kugeln!$X$4:$X$52,CONCATENATE(\"(\",Ergebnismenge!C173,\", \",F189,\")\"))","v":0},null,null,null,null,null,null,{"$f":"IF(AND(SUM($G$108:G188)>0,G189>0),\", \",\"\")","v":""},"",null,null,null,null,null,null,""]
[null,null,34,null,null,"grün",{"$f":"COUNTIF(Kugeln!$X$4:$X$52,CONCATENATE(\"(\",Ergebnismenge!C174,\", \",F190,\")\"))","v":0},null,null,null,null,null,null,{"$f":"IF(AND(SUM($G$108:G189)>0,G190>0),\", \",\"\")","v":""},"",null,null,null,null,null,null,""]
[null,null,35,null,null,"grün",{"$f":"COUNTIF(Kugeln!$X$4:$X$52,CONCATENATE(\"(\",Ergebnismenge!C175,\", \",F191,\")\"))","v":0},null,null,null,null,null,null,{"$f":"IF(AND(SUM($G$108:G190)>0,G191>0),\", \",\"\")","v":""},"",null,null,null,null,null,null,""]
[null,null,36,null,null,"grün",{"$f":"COUNTIF(Kugeln!$X$4:$X$52,CONCATENATE(\"(\",Ergebnismenge!C176,\", \",F192,\")\"))","v":0},null,null,null,null,null,null,{"$f":"IF(AND(SUM($G$108:G191)>0,G192>0),\", \",\"\")","v":""},"",null,null,null,null,null,null,""]
[null,null,37,null,null,"grün",{"$f":"COUNTIF(Kugeln!$X$4:$X$52,CONCATENATE(\"(\",Ergebnismenge!C177,\", \",F193,\")\"))","v":0},null,null,null,null,null,null,{"$f":"IF(AND(SUM($G$108:G192)>0,G193>0),\", \",\"\")","v":""},"",null,null,null,null,null,null,""]
[null,null,38,null,null,"grün",{"$f":"COUNTIF(Kugeln!$X$4:$X$52,CONCATENATE(\"(\",Ergebnismenge!C178,\", \",F194,\")\"))","v":0},null,null,null,null,null,null,{"$f":"IF(AND(SUM($G$108:G193)>0,G194>0),\", \",\"\")","v":""},"",null,null,null,null,null,null,""]
[null,null,39,null,null,"grün",{"$f":"COUNTIF(Kugeln!$X$4:$X$52,CONCATENATE(\"(\",Ergebnismenge!C179,\", \",F195,\")\"))","v":0},null,null,null,null,null,null,{"$f":"IF(AND(SUM($G$108:G194)>0,G195>0),\", \",\"\")","v":""},"",null,null,null,null,null,null,""]
[null,null,40,null,null,"grün",{"$f":"COUNTIF(Kugeln!$X$4:$X$52,CONCATENATE(\"(\",Ergebnismenge!C180,\", \",F196,\")\"))","v":0},null,null,null,null,null,null,{"$f":"IF(AND(SUM($G$108:G195)>0,G196>0),\", \",\"\")","v":""},"",null,null,null,null,null,null,""]
[null,null,41,null,null,"grün",{"$f":"COUNTIF(Kugeln!$X$4:$X$52,CONCATENATE(\"(\",Ergebnismenge!C181,\", \",F197,\")\"))","v":0},null,null,null,null,null,null,{"$f":"IF(AND(SUM($G$108:G196)>0,G197>0),\", \",\"\")","v":""},"",null,null,null,null,null,null,""]
[null,null,42,null,null,"grün",{"$f":"COUNTIF(Kugeln!$X$4:$X$52,CONCATENATE(\"(\",Ergebnismenge!C182,\", \",F198,\")\"))","v":0},null,null,null,null,null,null,{"$f":"IF(AND(SUM($G$108:G197)>0,G198>0),\", \",\"\")","v":""},"",null,null,null,null,null,null,""]
[null,null,43,null,null,"grün",{"$f":"COUNTIF(Kugeln!$X$4:$X$52,CONCATENATE(\"(\",Ergebnismenge!C183,\", \",F199,\")\"))","v":0},null,null,null,null,null,null,{"$f":"IF(AND(SUM($G$108:G198)>0,G199>0),\", \",\"\")","v":""},"",null,null,null,null,null,null,""]
[null,null,44,null,null,"grün",{"$f":"COUNTIF(Kugeln!$X$4:$X$52,CONCATENATE(\"(\",Ergebnismenge!C184,\", \",F200,\")\"))","v":0},null,null,null,null,null,null,{"$f":"IF(AND(SUM($G$108:G199)>0,G200>0),\", \",\"\")","v":""},"",null,null,null,null,null,null,""]
[null,null,45,null,null,"grün",{"$f":"COUNTIF(Kugeln!$X$4:$X$52,CONCATENATE(\"(\",Ergebnismenge!C185,\", \",F201,\")\"))","v":0},null,null,null,null,null,null,{"$f":"IF(AND(SUM($G$108:G200)>0,G201>0),\", \",\"\")","v":""},"",null,null,null,null,null,null,""]
[null,null,46,null,null,"grün",{"$f":"COUNTIF(Kugeln!$X$4:$X$52,CONCATENATE(\"(\",Ergebnismenge!C186,\", \",F202,\")\"))","v":0},null,null,null,null,null,null,{"$f":"IF(AND(SUM($G$108:G201)>0,G202>0),\", \",\"\")","v":""},"",null,null,null,null,null,null,""]
[null,null,47,null,null,"grün",{"$f":"COUNTIF(Kugeln!$X$4:$X$52,CONCATENATE(\"(\",Ergebnismenge!C187,\", \",F203,\")\"))","v":0},null,null,null,null,null,null,{"$f":"IF(AND(SUM($G$108:G202)>0,G203>0),\", \",\"\")","v":""},"",null,null,null,null,null,null,""]
[null,null,48,null,null,"grün",{"$f":"COUNTIF(Kugeln!$X$4:$X$52,CONCATENATE(\"(\",Ergebnismenge!C188,\", \",F204,\")\"))","v":0},null,null,null,null,null,null,{"$f":"IF(AND(SUM($G$108:G203)>0,G204>0),\", \",\"\")","v":""},"",null,null,null,null,null,null,""]
[null,null,49,null,null,"grün",{"$f":"COUNTIF(Kugeln!$X$4:$X$52,CONCATENATE(\"(\",Ergebnismenge!C189,\", \",F205,\")\"))","v":0},null,null,null,null,null,null,{"$f":"IF(AND(SUM($G$108:G204)>0,G205>0),\", \",\"\")","v":""},"",null,null,null,null,null,null,""]
[null,null,1,null,null,"blau",{"$f":"COUNTIF(Kugeln!$X$4:$X$52,CONCATENATE(\"(\",Ergebnismenge!C190,\", \",F206,\")\"))","v":0},null,null,null,null,null,null,{"$f":"IF(AND(SUM($G$108:G205)>0,G206>0),\", \",\"\")","v":""},"",null,null,null,null,null,null,""]
[null,null,2,null,null,"blau",{"$f":"COUNTIF(Kugeln!$X$4:$X$52,CONCATENATE(\"(\",Ergebnismenge!C191,\", \",F207,\")\"))","v":1},null,null,null,null,null,null,{"$f":"IF(AND(SUM($G$108:G206)>0,G207>0),\", \",\"\")","v":", "},"(blau, 2)",null,null,null,null,null,null,", (blau, 2)"]
[null,null,3,null,null,"blau",{"$f":"COUNTIF(Kugeln!$X$4:$X$52,CONCATENATE(\"(\",Ergebnismenge!C192,\", \",F208,\")\"))","v":0},null,null,null,null,null,null,{"$f":"IF(AND(SUM($G$108:G207)>0,G208>0),\", \",\"\")","v":""},"",null,null,null,null,null,null,""]
[null,null,4,null,null,"blau",{"$f":"COUNTIF(Kugeln!$X$4:$X$52,CONCATENATE(\"(\",Ergebnismenge!C193,\", \",F209,\")\"))","v":0},null,null,null,null,null,null,{"$f":"IF(AND(SUM($G$108:G208)>0,G209>0),\", \",\"\")","v":""},"",null,null,null,null,null,null,""]
[null,null,5,null,null,"blau",{"$f":"COUNTIF(Kugeln!$X$4:$X$52,CONCATENATE(\"(\",Ergebnismenge!C194,\", \",F210,\")\"))","v":2},null,null,null,null,null,null,{"$f":"IF(AND(SUM($G$108:G209)>0,G210>0),\", \",\"\")","v":", "},"(blau, 5)",null,null,null,null,null,null,", (blau, 5)"]
[null,null,6,null,null,"blau",{"$f":"COUNTIF(Kugeln!$X$4:$X$52,CONCATENATE(\"(\",Ergebnismenge!C195,\", \",F211,\")\"))","v":0},null,null,null,null,null,null,{"$f":"IF(AND(SUM($G$108:G210)>0,G211>0),\", \",\"\")","v":""},"",null,null,null,null,null,null,""]
[null,null,7,null,null,"blau",{"$f":"COUNTIF(Kugeln!$X$4:$X$52,CONCATENATE(\"(\",Ergebnismenge!C196,\", \",F212,\")\"))","v":1},null,null,null,null,null,null,{"$f":"IF(AND(SUM($G$108:G211)>0,G212>0),\", \",\"\")","v":", "},"(blau, 7)",null,null,null,null,null,null,", (blau, 7)"]
[null,null,8,null,null,"blau",{"$f":"COUNTIF(Kugeln!$X$4:$X$52,CONCATENATE(\"(\",Ergebnismenge!C197,\", \",F213,\")\"))","v":1},null,null,null,null,null,null,{"$f":"IF(AND(SUM($G$108:G212)>0,G213>0),\", \",\"\")","v":", "},"(blau, 8)",null,null,null,null,null,null,", (blau, 8)"]
[null,null,9,null,null,"blau",{"$f":"COUNTIF(Kugeln!$X$4:$X$52,CONCATENATE(\"(\",Ergebnismenge!C198,\", \",F214,\")\"))","v":2},null,null,null,null,null,null,{"$f":"IF(AND(SUM($G$108:G213)>0,G214>0),\", \",\"\")","v":", "},"(blau, 9)",null,null,null,null,null,null,", (blau, 9)"]
[null,null,10,null,null,"blau",{"$f":"COUNTIF(Kugeln!$X$4:$X$52,CONCATENATE(\"(\",Ergebnismenge!C199,\", \",F215,\")\"))","v":0},null,null,null,null,null,null,{"$f":"IF(AND(SUM($G$108:G214)>0,G215>0),\", \",\"\")","v":""},"",null,null,null,null,null,null,""]
[null,null,11,null,null,"blau",{"$f":"COUNTIF(Kugeln!$X$4:$X$52,CONCATENATE(\"(\",Ergebnismenge!C200,\", \",F216,\")\"))","v":0},null,null,null,null,null,null,{"$f":"IF(AND(SUM($G$108:G215)>0,G216>0),\", \",\"\")","v":""},"",null,null,null,null,null,null,""]
[null,null,12,null,null,"blau",{"$f":"COUNTIF(Kugeln!$X$4:$X$52,CONCATENATE(\"(\",Ergebnismenge!C201,\", \",F217,\")\"))","v":0},null,null,null,null,null,null,{"$f":"IF(AND(SUM($G$108:G216)>0,G217>0),\", \",\"\")","v":""},"",null,null,null,null,null,null,""]
[null,null,13,null,null,"blau",{"$f":"COUNTIF(Kugeln!$X$4:$X$52,CONCATENATE(\"(\",Ergebnismenge!C202,\", \",F218,\")\"))","v":0},null,null,null,null,null,null,{"$f":"IF(AND(SUM($G$108:G217)>0,G218>0),\", \",\"\")","v":""},"",null,null,null,null,null,null,""]
[null,null,14,null,null,"blau",{"$f":"COUNTIF(Kugeln!$X$4:$X$52,CONCATENATE(\"(\",Ergebnismenge!C203,\", \",F219,\")\"))","v":0},null,null,null,null,null,null,{"$f":"IF(AND(SUM($G$108:G218)>0,G219>0),\", \",\"\")","v":""},"",null,null,null,null,null,null,""]
[null,null,15,null,null,"blau",{"$f":"COUNTIF(Kugeln!$X$4:$X$52,CONCATENATE(\"(\",Ergebnismenge!C204,\", \",F220,\")\"))","v":0},null,null,null,null,null,null,{"$f":"IF(AND(SUM($G$108:G219)>0,G220>0),\", \",\"\")","v":""},"",null,null,null,null,null,null,""]
[null,null,16,null,null,"blau",{"$f":"COUNTIF(Kugeln!$X$4:$X$52,CONCATENATE(\"(\",Ergebnismenge!C205,\", \",F221,\")\"))","v":0},null,null,null,null,null,null,{"$f":"IF(AND(SUM($G$108:G220)>0,G221>0),\", \",\"\")","v":""},"",null,null,null,null,null,null,""]
[null,null,17,null,null,"blau",{"$f":"COUNTIF(Kugeln!$X$4:$X$52,CONCATENATE(\"(\",Ergebnismenge!C206,\", \",F222,\")\"))","v":0},null,null,null,null,null,null,{"$f":"IF(AND(SUM($G$108:G221)>0,G222>0),\", \",\"\")","v":""},"",null,null,null,null,null,null,""]
[null,null,18,null,null,"blau",{"$f":"COUNTIF(Kugeln!$X$4:$X$52,CONCATENATE(\"(\",Ergebnismenge!C207,\", \",F223,\")\"))","v":0},null,null,null,null,null,null,{"$f":"IF(AND(SUM($G$108:G222)>0,G223>0),\", \",\"\")","v":""},"",null,null,null,null,null,null,""]
[null,null,19,null,null,"blau",{"$f":"COUNTIF(Kugeln!$X$4:$X$52,CONCATENATE(\"(\",Ergebnismenge!C208,\", \",F224,\")\"))","v":0},null,null,null,null,null,null,{"$f":"IF(AND(SUM($G$108:G223)>0,G224>0),\", \",\"\")","v":""},"",null,null,null,null,null,null,""]
[null,null,20,null,null,"blau",{"$f":"COUNTIF(Kugeln!$X$4:$X$52,CONCATENATE(\"(\",Ergebnismenge!C209,\", \",F225,\")\"))","v":0},null,null,null,null,null,null,{"$f":"IF(AND(SUM($G$108:G224)>0,G225>0),\", \",\"\")","v":""},"",null,null,null,null,null,null,""]
[null,null,21,null,null,"blau",{"$f":"COUNTIF(Kugeln!$X$4:$X$52,CONCATENATE(\"(\",Ergebnismenge!C210,\", \",F226,\")\"))","v":0},null,null,null,null,null,null,{"$f":"IF(AND(SUM($G$108:G225)>0,G226>0),\", \",\"\")","v":""},"",null,null,null,null,null,null,""]
[null,null,22,null,null,"blau",{"$f":"COUNTIF(Kugeln!$X$4:$X$52,CONCATENATE(\"(\",Ergebnismenge!C211,\", \",F227,\")\"))","v":0},null,null,null,null,null,null,{"$f":"IF(AND(SUM($G$108:G226)>0,G227>0),\", \",\"\")","v":""},"",null,null,null,null,null,null,""]
[null,null,23,null,null,"blau",{"$f":"COUNTIF(Kugeln!$X$4:$X$52,CONCATENATE(\"(\",Ergebnismenge!C212,\", \",F228,\")\"))","v":0},null,null,null,null,null,null,{"$f":"IF(AND(SUM($G$108:G227)>0,G228>0),\", \",\"\")","v":""},"",null,null,null,null,null,null,""]
[null,null,24,null,null,"blau",{"$f":"COUNTIF(Kugeln!$X$4:$X$52,CONCATENATE(\"(\",Ergebnismenge!C213,\", \",F229,\")\"))","v":0},null,null,null,null,null,null,{"$f":"IF(AND(SUM($G$108:G228)>0,G229>0),\", \",\"\")","v":""},"",null,null,null,null,null,null,""]
[null,null,25,null,null,"blau",{"$f":"COUNTIF(Kugeln!$X$4:$X$52,CONCATENATE(\"(\",Ergebnismenge!C214,\", \",F230,\")\"))","v":0},null,null,null,null,null,null,{"$f":"IF(AND(SUM($G$108:G229)>0,G230>0),\", \",\"\")","v":""},"",null,null,null,null,null,null,""]
[null,null,26,null,null,"blau",{"$f":"COUNTIF(Kugeln!$X$4:$X$52,CONCATENATE(\"(\",Ergebnismenge!C215,\", \",F231,\")\"))","v":0},null,null,null,null,null,null,{"$f":"IF(AND(SUM($G$108:G230)>0,G231>0),\", \",\"\")","v":""},"",null,null,null,null,null,null,""]
[null,null,27,null,null,"blau",{"$f":"COUNTIF(Kugeln!$X$4:$X$52,CONCATENATE(\"(\",Ergebnismenge!C216,\", \",F232,\")\"))","v":0},null,null,null,null,null,null,{"$f":"IF(AND(SUM($G$108:G231)>0,G232>0),\", \",\"\")","v":""},"",null,null,null,null,null,null,""]
[null,null,28,null,null,"blau",{"$f":"COUNTIF(Kugeln!$X$4:$X$52,CONCATENATE(\"(\",Ergebnismenge!C217,\", \",F233,\")\"))","v":0},null,null,null,null,null,null,{"$f":"IF(AND(SUM($G$108:G232)>0,G233>0),\", \",\"\")","v":""},"",null,null,null,null,null,null,""]
[null,null,29,null,null,"blau",{"$f":"COUNTIF(Kugeln!$X$4:$X$52,CONCATENATE(\"(\",Ergebnismenge!C218,\", \",F234,\")\"))","v":0},null,null,null,null,null,null,{"$f":"IF(AND(SUM($G$108:G233)>0,G234>0),\", \",\"\")","v":""},"",null,null,null,null,null,null,""]
[null,null,30,null,null,"blau",{"$f":"COUNTIF(Kugeln!$X$4:$X$52,CONCATENATE(\"(\",Ergebnismenge!C219,\", \",F235,\")\"))","v":0},null,null,null,null,null,null,{"$f":"IF(AND(SUM($G$108:G234)>0,G235>0),\", \",\"\")","v":""},"",null,null,null,null,null,null,""]
[null,null,31,null,null,"blau",{"$f":"COUNTIF(Kugeln!$X$4:$X$52,CONCATENATE(\"(\",Ergebnismenge!C220,\", \",F236,\")\"))","v":0},null,null,null,null,null,null,{"$f":"IF(AND(SUM($G$108:G235)>0,G236>0),\", \",\"\")","v":""},"",null,null,null,null,null,null,""]
[null,null,32,null,null,"blau",{"$f":"COUNTIF(Kugeln!$X$4:$X$52,CONCATENATE(\"(\",Ergebnismenge!C221,\", \",F237,\")\"))","v":0},null,null,null,null,null,null,{"$f":"IF(AND(SUM($G$108:G236)>0,G237>0),\", \",\"\")","v":""},"",null,null,null,null,null,null,""]
[null,null,33,null,null,"blau",{"$f":"COUNTIF(Kugeln!$X$4:$X$52,CONCATENATE(\"(\",Ergebnismenge!C222,\", \",F238,\")\"))","v":0},null,null,null,null,null,null,{"$f":"IF(AND(SUM($G$108:G237)>0,G238>0),\", \",\"\")","v":""},"",null,null,null,null,null,null,""]
[null,null,34,null,null,"blau",{"$f":"COUNTIF(Kugeln!$X$4:$X$52,CONCATENATE(\"(\",Ergebnismenge!C223,\", \",F239,\")\"))","v":0},null,null,null,null,null,null,{"$f":"IF(AND(SUM($G$108:G238)>0,G239>0),\", \",\"\")","v":""},{"$f":"IF(G239>0,CONCATENATE(\"(\",F239,\", \",C239,\")\"),\"\")","v":""},null,null,null,null,null,null,""]
[null,null,35,null,null,"blau",{"$f":"COUNTIF(Kugeln!$X$4:$X$52,CONCATENATE(\"(\",Ergebnismenge!C224,\", \",F240,\")\"))","v":0},null,null,null,null,null,null,{"$f":"IF(AND(SUM($G$108:G239)>0,G240>0),\", \",\"\")","v":""},"",null,null,null,null,null,null,""]
[null,null,36,null,null,"blau",{"$f":"COUNTIF(Kugeln!$X$4:$X$52,CONCATENATE(\"(\",Ergebnismenge!C225,\", \",F241,\")\"))","v":0},null,null,null,null,null,null,{"$f":"IF(AND(SUM($G$108:G240)>0,G241>0),\", \",\"\")","v":""},"",null,null,null,null,null,null,{"$f":"CONCATENATE(N241,O241)","v":""}]
[null,null,37,null,null,"blau",{"$f":"COUNTIF(Kugeln!$X$4:$X$52,CONCATENATE(\"(\",Ergebnismenge!C226,\", \",F242,\")\"))","v":0},null,null,null,null,null,null,{"$f":"IF(AND(SUM($G$108:G241)>0,G242>0),\", \",\"\")","v":""},"",null,null,null,null,null,null,""]
[null,null,38,null,null,"blau",{"$f":"COUNTIF(Kugeln!$X$4:$X$52,CONCATENATE(\"(\",Ergebnismenge!C227,\", \",F243,\")\"))","v":0},null,null,null,null,null,null,{"$f":"IF(AND(SUM($G$108:G242)>0,G243>0),\", \",\"\")","v":""},"",null,null,null,null,null,null,""]
[null,null,39,null,null,"blau",{"$f":"COUNTIF(Kugeln!$X$4:$X$52,CONCATENATE(\"(\",Ergebnismenge!C228,\", \",F244,\")\"))","v":0},null,null,null,null,null,null,{"$f":"IF(AND(SUM($G$108:G243)>0,G244>0),\", \",\"\")","v":""},"",null,null,null,null,null,null,""]
[null,null,40,null,null,"blau",{"$f":"COUNTIF(Kugeln!$X$4:$X$52,CONCATENATE(\"(\",Ergebnismenge!C229,\", \",F245,\")\"))","v":0},null,null,null,null,null,null,{"$f":"IF(AND(SUM($G$108:G244)>0,G245>0),\", \",\"\")","v":""},"",null,null,null,null,null,null,""]
[null,null,41,null,null,"blau",{"$f":"COUNTIF(Kugeln!$X$4:$X$52,CONCATENATE(\"(\",Ergebnismenge!C230,\", \",F246,\")\"))","v":0},null,null,null,null,null,null,{"$f":"IF(AND(SUM($G$108:G245)>0,G246>0),\", \",\"\")","v":""},"",null,null,null,null,null,null,""]
[null,null,42,null,null,"blau",{"$f":"COUNTIF(Kugeln!$X$4:$X$52,CONCATENATE(\"(\",Ergebnismenge!C231,\", \",F247,\")\"))","v":0},null,null,null,null,null,null,{"$f":"IF(AND(SUM($G$108:G246)>0,G247>0),\", \",\"\")","v":""},"",null,null,null,null,null,null,""]
[null,null,43,null,null,"blau",{"$f":"COUNTIF(Kugeln!$X$4:$X$52,CONCATENATE(\"(\",Ergebnismenge!C232,\", \",F248,\")\"))","v":0},null,null,null,null,null,null,{"$f":"IF(AND(SUM($G$108:G247)>0,G248>0),\", \",\"\")","v":""},"",null,null,null,null,null,null,""]
[null,null,44,null,null,"blau",{"$f":"COUNTIF(Kugeln!$X$4:$X$52,CONCATENATE(\"(\",Ergebnismenge!C233,\", \",F249,\")\"))","v":0},null,null,null,null,null,null,{"$f":"IF(AND(SUM($G$108:G248)>0,G249>0),\", \",\"\")","v":""},"",null,null,null,null,null,null,""]
[null,null,45,null,null,"blau",{"$f":"COUNTIF(Kugeln!$X$4:$X$52,CONCATENATE(\"(\",Ergebnismenge!C234,\", \",F250,\")\"))","v":0},null,null,null,null,null,null,{"$f":"IF(AND(SUM($G$108:G249)>0,G250>0),\", \",\"\")","v":""},"",null,null,null,null,null,null,""]
[null,null,46,null,null,"blau",{"$f":"COUNTIF(Kugeln!$X$4:$X$52,CONCATENATE(\"(\",Ergebnismenge!C235,\", \",F251,\")\"))","v":0},null,null,null,null,null,null,{"$f":"IF(AND(SUM($G$108:G250)>0,G251>0),\", \",\"\")","v":""},"",null,null,null,null,null,null,""]
[null,null,47,null,null,"blau",{"$f":"COUNTIF(Kugeln!$X$4:$X$52,CONCATENATE(\"(\",Ergebnismenge!C236,\", \",F252,\")\"))","v":0},null,null,null,null,null,null,{"$f":"IF(AND(SUM($G$108:G251)>0,G252>0),\", \",\"\")","v":""},"",null,null,null,null,null,null,""]
[null,null,48,null,null,"blau",{"$f":"COUNTIF(Kugeln!$X$4:$X$52,CONCATENATE(\"(\",Ergebnismenge!C237,\", \",F253,\")\"))","v":0},null,null,null,null,null,null,{"$f":"IF(AND(SUM($G$108:G252)>0,G253>0),\", \",\"\")","v":""},"",null,null,null,null,null,null,""]
[null,null,49,null,null,"blau",{"$f":"COUNTIF(Kugeln!$X$4:$X$52,CONCATENATE(\"(\",Ergebnismenge!C238,\", \",F254,\")\"))","v":0},null,null,null,null,null,null,{"$f":"IF(AND(SUM($G$108:G253)>0,G254>0),\", \",\"\")","v":""},"",null,null,null,null,null,null,""]
[null,null,1,null,null,"gelb",{"$f":"COUNTIF(Kugeln!$X$4:$X$52,CONCATENATE(\"(\",Ergebnismenge!C239,\", \",F255,\")\"))","v":0},null,null,null,null,null,null,{"$f":"IF(AND(SUM($G$108:G254)>0,G255>0),\", \",\"\")","v":""},"",null,null,null,null,null,null,""]
[null,null,2,null,null,"gelb",{"$f":"COUNTIF(Kugeln!$X$4:$X$52,CONCATENATE(\"(\",Ergebnismenge!C240,\", \",F256,\")\"))","v":0},null,null,null,null,null,null,{"$f":"IF(AND(SUM($G$108:G255)>0,G256>0),\", \",\"\")","v":""},"",null,null,null,null,null,null,""]
[null,null,3,null,null,"gelb",{"$f":"COUNTIF(Kugeln!$X$4:$X$52,CONCATENATE(\"(\",Ergebnismenge!C241,\", \",F257,\")\"))","v":1},null,null,null,null,null,null,{"$f":"IF(AND(SUM($G$108:G256)>0,G257>0),\", \",\"\")","v":", "},"(gelb, 3)",null,null,null,null,null,null,", (gelb, 3)"]
[null,null,4,null,null,"gelb",{"$f":"COUNTIF(Kugeln!$X$4:$X$52,CONCATENATE(\"(\",Ergebnismenge!C242,\", \",F258,\")\"))","v":1},null,null,null,null,null,null,{"$f":"IF(AND(SUM($G$108:G257)>0,G258>0),\", \",\"\")","v":", "},"(gelb, 4)",null,null,null,null,null,null,", (gelb, 4)"]
[null,null,5,null,null,"gelb",{"$f":"COUNTIF(Kugeln!$X$4:$X$52,CONCATENATE(\"(\",Ergebnismenge!C243,\", \",F259,\")\"))","v":2},null,null,null,null,null,null,{"$f":"IF(AND(SUM($G$108:G258)>0,G259>0),\", \",\"\")","v":", "},"(gelb, 5)",null,null,null,null,null,null,", (gelb, 5)"]
[null,null,6,null,null,"gelb",{"$f":"COUNTIF(Kugeln!$X$4:$X$52,CONCATENATE(\"(\",Ergebnismenge!C244,\", \",F260,\")\"))","v":2},null,null,null,null,null,null,{"$f":"IF(AND(SUM($G$108:G259)>0,G260>0),\", \",\"\")","v":", "},"(gelb, 6)",null,null,null,null,null,null,", (gelb, 6)"]
[null,null,7,null,null,"gelb",{"$f":"COUNTIF(Kugeln!$X$4:$X$52,CONCATENATE(\"(\",Ergebnismenge!C245,\", \",F261,\")\"))","v":1},null,null,null,null,null,null,{"$f":"IF(AND(SUM($G$108:G260)>0,G261>0),\", \",\"\")","v":", "},"(gelb, 7)",null,null,null,null,null,null,", (gelb, 7)"]
[null,null,8,null,null,"gelb",{"$f":"COUNTIF(Kugeln!$X$4:$X$52,CONCATENATE(\"(\",Ergebnismenge!C246,\", \",F262,\")\"))","v":0},null,null,null,null,null,null,{"$f":"IF(AND(SUM($G$108:G261)>0,G262>0),\", \",\"\")","v":""},"",null,null,null,null,null,null,""]
[null,null,9,null,null,"gelb",{"$f":"COUNTIF(Kugeln!$X$4:$X$52,CONCATENATE(\"(\",Ergebnismenge!C247,\", \",F263,\")\"))","v":2},null,null,null,null,null,null,{"$f":"IF(AND(SUM($G$108:G262)>0,G263>0),\", \",\"\")","v":", "},"(gelb, 9)",null,null,null,null,null,null,", (gelb, 9)"]
[null,null,10,null,null,"gelb",{"$f":"COUNTIF(Kugeln!$X$4:$X$52,CONCATENATE(\"(\",Ergebnismenge!C248,\", \",F264,\")\"))","v":0},null,null,null,null,null,null,{"$f":"IF(AND(SUM($G$108:G263)>0,G264>0),\", \",\"\")","v":""},"",null,null,null,null,null,null,""]
[null,null,11,null,null,"gelb",{"$f":"COUNTIF(Kugeln!$X$4:$X$52,CONCATENATE(\"(\",Ergebnismenge!C249,\", \",F265,\")\"))","v":0},null,null,null,null,null,null,{"$f":"IF(AND(SUM($G$108:G264)>0,G265>0),\", \",\"\")","v":""},"",null,null,null,null,null,null,""]
[null,null,12,null,null,"gelb",{"$f":"COUNTIF(Kugeln!$X$4:$X$52,CONCATENATE(\"(\",Ergebnismenge!C250,\", \",F266,\")\"))","v":0},null,null,null,null,null,null,{"$f":"IF(AND(SUM($G$108:G265)>0,G266>0),\", \",\"\")","v":""},"",null,null,null,null,null,null,""]
[null,null,13,null,null,"gelb",{"$f":"COUNTIF(Kugeln!$X$4:$X$52,CONCATENATE(\"(\",Ergebnismenge!C251,\", \",F267,\")\"))","v":0},null,null,null,null,null,null,{"$f":"IF(AND(SUM($G$108:G266)>0,G267>0),\", \",\"\")","v":""},"",null,null,null,null,null,null,""]
[null,null,14,null,null,"gelb",{"$f":"COUNTIF(Kugeln!$X$4:$X$52,CONCATENATE(\"(\",Ergebnismenge!C252,\", \",F268,\")\"))","v":0},null,null,null,null,null,null,{"$f":"IF(AND(SUM($G$108:G267)>0,G268>0),\", \",\"\")","v":""},"",null,null,null,null,null,null,""]
[null,null,15,null,null,"gelb",{"$f":"COUNTIF(Kugeln!$X$4:$X$52,CONCATENATE(\"(\",Ergebnismenge!C253,\", \",F269,\")\"))","v":0},null,null,null,null,null,null,{"$f":"IF(AND(SUM($G$108:G268)>0,G269>0),\", \",\"\")","v":""},"",null,null,null,null,null,null,""]
[null,null,16,null,null,"gelb",{"$f":"COUNTIF(Kugeln!$X$4:$X$52,CONCATENATE(\"(\",Ergebnismenge!C254,\", \",F270,\")\"))","v":0},null,null,null,null,null,null,{"$f":"IF(AND(SUM($G$108:G269)>0,G270>0),\", \",\"\")","v":""},"",null,null,null,null,null,null,""]
[null,null,17,null,null,"gelb",{"$f":"COUNTIF(Kugeln!$X$4:$X$52,CONCATENATE(\"(\",Ergebnismenge!C255,\", \",F271,\")\"))","v":0},null,null,null,null,null,null,{"$f":"IF(AND(SUM($G$108:G270)>0,G271>0),\", \",\"\")","v":""},"",null,null,null,null,null,null,""]
[null,null,18,null,null,"gelb",{"$f":"COUNTIF(Kugeln!$X$4:$X$52,CONCATENATE(\"(\",Ergebnismenge!C256,\", \",F272,\")\"))","v":0},null,null,null,null,null,null,{"$f":"IF(AND(SUM($G$108:G271)>0,G272>0),\", \",\"\")","v":""},"",null,null,null,null,null,null,""]
[null,null,19,null,null,"gelb",{"$f":"COUNTIF(Kugeln!$X$4:$X$52,CONCATENATE(\"(\",Ergebnismenge!C257,\", \",F273,\")\"))","v":0},null,null,null,null,null,null,{"$f":"IF(AND(SUM($G$108:G272)>0,G273>0),\", \",\"\")","v":""},"",null,null,null,null,null,null,""]
[null,null,20,null,null,"gelb",{"$f":"COUNTIF(Kugeln!$X$4:$X$52,CONCATENATE(\"(\",Ergebnismenge!C258,\", \",F274,\")\"))","v":0},null,null,null,null,null,null,{"$f":"IF(AND(SUM($G$108:G273)>0,G274>0),\", \",\"\")","v":""},"",null,null,null,null,null,null,""]
[null,null,21,null,null,"gelb",{"$f":"COUNTIF(Kugeln!$X$4:$X$52,CONCATENATE(\"(\",Ergebnismenge!C259,\", \",F275,\")\"))","v":0},null,null,null,null,null,null,{"$f":"IF(AND(SUM($G$108:G274)>0,G275>0),\", \",\"\")","v":""},"",null,null,null,null,null,null,""]
[null,null,22,null,null,"gelb",{"$f":"COUNTIF(Kugeln!$X$4:$X$52,CONCATENATE(\"(\",Ergebnismenge!C260,\", \",F276,\")\"))","v":0},null,null,null,null,null,null,{"$f":"IF(AND(SUM($G$108:G275)>0,G276>0),\", \",\"\")","v":""},"",null,null,null,null,null,null,""]
[null,null,23,null,null,"gelb",{"$f":"COUNTIF(Kugeln!$X$4:$X$52,CONCATENATE(\"(\",Ergebnismenge!C261,\", \",F277,\")\"))","v":0},null,null,null,null,null,null,{"$f":"IF(AND(SUM($G$108:G276)>0,G277>0),\", \",\"\")","v":""},"",null,null,null,null,null,null,""]
[null,null,24,null,null,"gelb",{"$f":"COUNTIF(Kugeln!$X$4:$X$52,CONCATENATE(\"(\",Ergebnismenge!C262,\", \",F278,\")\"))","v":0},null,null,null,null,null,null,{"$f":"IF(AND(SUM($G$108:G277)>0,G278>0),\", \",\"\")","v":""},"",null,null,null,null,null,null,""]
[null,null,25,null,null,"gelb",{"$f":"COUNTIF(Kugeln!$X$4:$X$52,CONCATENATE(\"(\",Ergebnismenge!C263,\", \",F279,\")\"))","v":0},null,null,null,null,null,null,{"$f":"IF(AND(SUM($G$108:G278)>0,G279>0),\", \",\"\")","v":""},"",null,null,null,null,null,null,""]
[null,null,26,null,null,"gelb",{"$f":"COUNTIF(Kugeln!$X$4:$X$52,CONCATENATE(\"(\",Ergebnismenge!C264,\", \",F280,\")\"))","v":0},null,null,null,null,null,null,{"$f":"IF(AND(SUM($G$108:G279)>0,G280>0),\", \",\"\")","v":""},"",null,null,null,null,null,null,""]
[null,null,27,null,null,"gelb",{"$f":"COUNTIF(Kugeln!$X$4:$X$52,CONCATENATE(\"(\",Ergebnismenge!C265,\", \",F281,\")\"))","v":0},null,null,null,null,null,null,{"$f":"IF(AND(SUM($G$108:G280)>0,G281>0),\", \",\"\")","v":""},"",null,null,null,null,null,null,""]
[null,null,28,null,null,"gelb",{"$f":"COUNTIF(Kugeln!$X$4:$X$52,CONCATENATE(\"(\",Ergebnismenge!C266,\", \",F282,\")\"))","v":0},null,null,null,null,null,null,{"$f":"IF(AND(SUM($G$108:G281)>0,G282>0),\", \",\"\")","v":""},"",null,null,null,null,null,null,""]
[null,null,29,null,null,"gelb",{"$f":"COUNTIF(Kugeln!$X$4:$X$52,CONCATENATE(\"(\",Ergebnismenge!C267,\", \",F283,\")\"))","v":0},null,null,null,null,null,null,{"$f":"IF(AND(SUM($G$108:G282)>0,G283>0),\", \",\"\")","v":""},"",null,null,null,null,null,null,""]
[null,null,30,null,null,"gelb",{"$f":"COUNTIF(Kugeln!$X$4:$X$52,CONCATENATE(\"(\",Ergebnismenge!C268,\", \",F284,\")\"))","v":0},null,null,null,null,null,null,{"$f":"IF(AND(SUM($G$108:G283)>0,G284>0),\", \",\"\")","v":""},"",null,null,null,null,null,null,""]
[null,null,31,null,null,"gelb",{"$f":"COUNTIF(Kugeln!$X$4:$X$52,CONCATENATE(\"(\",Ergebnismenge!C269,\", \",F285,\")\"))","v":0},null,null,null,null,null,null,{"$f":"IF(AND(SUM($G$108:G284)>0,G285>0),\", \",\"\")","v":""},"",null,null,null,null,null,null,""]
[null,null,32,null,null,"gelb",{"$f":"COUNTIF(Kugeln!$X$4:$X$52,CONCATENATE(\"(\",Ergebnismenge!C270,\", \",F286,\")\"))","v":0},null,null,null,null,null,null,{"$f":"IF(AND(SUM($G$108:G285)>0,G286>0),\", \",\"\")","v":""},"",null,null,null,null,null,null,""]
[null,null,33,null,null,"gelb",{"$f":"COUNTIF(Kugeln!$X$4:$X$52,CONCATENATE(\"(\",Ergebnismenge!C271,\", \",F287,\")\"))","v":0},null,null,null,null,null,null,{"$f":"IF(AND(SUM($G$108:G286)>0,G287>0),\", \",\"\")","v":""},"",null,null,null,null,null,null,""]
[null,null,34,null,null,"gelb",{"$f":"COUNTIF(Kugeln!$X$4:$X$52,CONCATENATE(\"(\",Ergebnismenge!C272,\", \",F288,\")\"))","v":0},null,null,null,null,null,null,{"$f":"IF(AND(SUM($G$108:G287)>0,G288>0),\", \",\"\")","v":""},"",null,null,null,null,null,null,""]
[null,null,35,null,null,"gelb",{"$f":"COUNTIF(Kugeln!$X$4:$X$52,CONCATENATE(\"(\",Ergebnismenge!C273,\", \",F289,\")\"))","v":0},null,null,null,null,null,null,{"$f":"IF(AND(SUM($G$108:G288)>0,G289>0),\", \",\"\")","v":""},"",null,null,null,null,null,null,""]
[null,null,36,null,null,"gelb",{"$f":"COUNTIF(Kugeln!$X$4:$X$52,CONCATENATE(\"(\",Ergebnismenge!C274,\", \",F290,\")\"))","v":0},null,null,null,null,null,null,{"$f":"IF(AND(SUM($G$108:G289)>0,G290>0),\", \",\"\")","v":""},"",null,null,null,null,null,null,""]
[null,null,37,null,null,"gelb",{"$f":"COUNTIF(Kugeln!$X$4:$X$52,CONCATENATE(\"(\",Ergebnismenge!C275,\", \",F291,\")\"))","v":0},null,null,null,null,null,null,{"$f":"IF(AND(SUM($G$108:G290)>0,G291>0),\", \",\"\")","v":""},"",null,null,null,null,null,null,""]
[null,null,38,null,null,"gelb",{"$f":"COUNTIF(Kugeln!$X$4:$X$52,CONCATENATE(\"(\",Ergebnismenge!C276,\", \",F292,\")\"))","v":0},null,null,null,null,null,null,{"$f":"IF(AND(SUM($G$108:G291)>0,G292>0),\", \",\"\")","v":""},"",null,null,null,null,null,null,""]
[null,null,39,null,null,"gelb",{"$f":"COUNTIF(Kugeln!$X$4:$X$52,CONCATENATE(\"(\",Ergebnismenge!C277,\", \",F293,\")\"))","v":0},null,null,null,null,null,null,{"$f":"IF(AND(SUM($G$108:G292)>0,G293>0),\", \",\"\")","v":""},"",null,null,null,null,null,null,""]
[null,null,40,null,null,"gelb",{"$f":"COUNTIF(Kugeln!$X$4:$X$52,CONCATENATE(\"(\",Ergebnismenge!C278,\", \",F294,\")\"))","v":0},null,null,null,null,null,null,{"$f":"IF(AND(SUM($G$108:G293)>0,G294>0),\", \",\"\")","v":""},"",null,null,null,null,null,null,""]
[null,null,41,null,null,"gelb",{"$f":"COUNTIF(Kugeln!$X$4:$X$52,CONCATENATE(\"(\",Ergebnismenge!C279,\", \",F295,\")\"))","v":0},null,null,null,null,null,null,{"$f":"IF(AND(SUM($G$108:G294)>0,G295>0),\", \",\"\")","v":""},"",null,null,null,null,null,null,""]
[null,null,42,null,null,"gelb",{"$f":"COUNTIF(Kugeln!$X$4:$X$52,CONCATENATE(\"(\",Ergebnismenge!C280,\", \",F296,\")\"))","v":0},null,null,null,null,null,null,{"$f":"IF(AND(SUM($G$108:G295)>0,G296>0),\", \",\"\")","v":""},"",null,null,null,null,null,null,""]
[null,null,43,null,null,"gelb",{"$f":"COUNTIF(Kugeln!$X$4:$X$52,CONCATENATE(\"(\",Ergebnismenge!C281,\", \",F297,\")\"))","v":0},null,null,null,null,null,null,{"$f":"IF(AND(SUM($G$108:G296)>0,G297>0),\", \",\"\")","v":""},"",null,null,null,null,null,null,""]
[null,null,44,null,null,"gelb",{"$f":"COUNTIF(Kugeln!$X$4:$X$52,CONCATENATE(\"(\",Ergebnismenge!C282,\", \",F298,\")\"))","v":0},null,null,null,null,null,null,{"$f":"IF(AND(SUM($G$108:G297)>0,G298>0),\", \",\"\")","v":""},"",null,null,null,null,null,null,""]
[null,null,45,null,null,"gelb",{"$f":"COUNTIF(Kugeln!$X$4:$X$52,CONCATENATE(\"(\",Ergebnismenge!C283,\", \",F299,\")\"))","v":0},null,null,null,null,null,null,{"$f":"IF(AND(SUM($G$108:G298)>0,G299>0),\", \",\"\")","v":""},"",null,null,null,null,null,null,""]
[null,null,46,null,null,"gelb",{"$f":"COUNTIF(Kugeln!$X$4:$X$52,CONCATENATE(\"(\",Ergebnismenge!C284,\", \",F300,\")\"))","v":0},null,null,null,null,null,null,{"$f":"IF(AND(SUM($G$108:G299)>0,G300>0),\", \",\"\")","v":""},"",null,null,null,null,null,null,""]
[null,null,47,null,null,"gelb",{"$f":"COUNTIF(Kugeln!$X$4:$X$52,CONCATENATE(\"(\",Ergebnismenge!C285,\", \",F301,\")\"))","v":0},null,null,null,null,null,null,{"$f":"IF(AND(SUM($G$108:G300)>0,G301>0),\", \",\"\")","v":""},"",null,null,null,null,null,null,""]
[null,null,48,null,null,"gelb",{"$f":"COUNTIF(Kugeln!$X$4:$X$52,CONCATENATE(\"(\",Ergebnismenge!C286,\", \",F302,\")\"))","v":0},null,null,null,null,null,null,{"$f":"IF(AND(SUM($G$108:G301)>0,G302>0),\", \",\"\")","v":""},"",null,null,null,null,null,null,""]
[null,null,49,null,null,"gelb",{"$f":"COUNTIF(Kugeln!$X$4:$X$52,CONCATENATE(\"(\",Ergebnismenge!C287,\", \",F303,\")\"))","v":0},null,null,null,null,null,null,{"$f":"IF(AND(SUM($G$108:G302)>0,G303>0),\", \",\"\")","v":""},{"$f":"IF(G303>0,CONCATENATE(\"(\",F303,\", \",C303,\")\"),\"\")","v":""},null,null,null,null,null,null,""]
[null,null,1,null,null,"grau",{"$f":"COUNTIF(Kugeln!$X$4:$X$52,CONCATENATE(\"(\",Ergebnismenge!C288,\", \",F304,\")\"))","v":0},null,null,null,null,null,null,{"$f":"IF(AND(SUM($G$108:G303)>0,G304>0),\", \",\"\")","v":""},"",null,null,null,null,null,null,""]
[null,null,2,null,null,"grau",{"$f":"COUNTIF(Kugeln!$X$4:$X$52,CONCATENATE(\"(\",Ergebnismenge!C289,\", \",F305,\")\"))","v":4},null,null,null,null,null,null,{"$f":"IF(AND(SUM($G$108:G304)>0,G305>0),\", \",\"\")","v":", "},"(grau, 2)",null,null,null,null,null,null,{"$f":"CONCATENATE(N305,O305)","v":", (grau, 2)"}]
[null,null,3,null,null,"grau",{"$f":"COUNTIF(Kugeln!$X$4:$X$52,CONCATENATE(\"(\",Ergebnismenge!C290,\", \",F306,\")\"))","v":1},null,null,null,null,null,null,{"$f":"IF(AND(SUM($G$108:G305)>0,G306>0),\", \",\"\")","v":", "},"(grau, 3)",null,null,null,null,null,null,", (grau, 3)"]
[null,null,4,null,null,"grau",{"$f":"COUNTIF(Kugeln!$X$4:$X$52,CONCATENATE(\"(\",Ergebnismenge!C291,\", \",F307,\")\"))","v":1},null,null,null,null,null,null,{"$f":"IF(AND(SUM($G$108:G306)>0,G307>0),\", \",\"\")","v":", "},"(grau, 4)",null,null,null,null,null,null,", (grau, 4)"]
[null,null,5,null,null,"grau",{"$f":"COUNTIF(Kugeln!$X$4:$X$52,CONCATENATE(\"(\",Ergebnismenge!C292,\", \",F308,\")\"))","v":2},null,null,null,null,null,null,{"$f":"IF(AND(SUM($G$108:G307)>0,G308>0),\", \",\"\")","v":", "},"(grau, 5)",null,null,null,null,null,null,", (grau, 5)"]
[null,null,6,null,null,"grau",{"$f":"COUNTIF(Kugeln!$X$4:$X$52,CONCATENATE(\"(\",Ergebnismenge!C293,\", \",F309,\")\"))","v":1},null,null,null,null,null,null,{"$f":"IF(AND(SUM($G$108:G308)>0,G309>0),\", \",\"\")","v":", "},"(grau, 6)",null,null,null,null,null,null,", (grau, 6)"]
[null,null,7,null,null,"grau",{"$f":"COUNTIF(Kugeln!$X$4:$X$52,CONCATENATE(\"(\",Ergebnismenge!C294,\", \",F310,\")\"))","v":2},null,null,null,null,null,null,{"$f":"IF(AND(SUM($G$108:G309)>0,G310>0),\", \",\"\")","v":", "},"(grau, 7)",null,null,null,null,null,null,", (grau, 7)"]
[null,null,8,null,null,"grau",{"$f":"COUNTIF(Kugeln!$X$4:$X$52,CONCATENATE(\"(\",Ergebnismenge!C295,\", \",F311,\")\"))","v":1},null,null,null,null,null,null,{"$f":"IF(AND(SUM($G$108:G310)>0,G311>0),\", \",\"\")","v":", "},"(grau, 8)",null,null,null,null,null,null,", (grau, 8)"]
[null,null,9,null,null,"grau",{"$f":"COUNTIF(Kugeln!$X$4:$X$52,CONCATENATE(\"(\",Ergebnismenge!C296,\", \",F312,\")\"))","v":0},null,null,null,null,null,null,{"$f":"IF(AND(SUM($G$108:G311)>0,G312>0),\", \",\"\")","v":""},"",null,null,null,null,null,null,""]
[null,null,10,null,null,"grau",{"$f":"COUNTIF(Kugeln!$X$4:$X$52,CONCATENATE(\"(\",Ergebnismenge!C297,\", \",F313,\")\"))","v":0},null,null,null,null,null,null,{"$f":"IF(AND(SUM($G$108:G312)>0,G313>0),\", \",\"\")","v":""},"",null,null,null,null,null,null,""]
[null,null,11,null,null,"grau",{"$f":"COUNTIF(Kugeln!$X$4:$X$52,CONCATENATE(\"(\",Ergebnismenge!C298,\", \",F314,\")\"))","v":0},null,null,null,null,null,null,{"$f":"IF(AND(SUM($G$108:G313)>0,G314>0),\", \",\"\")","v":""},"",null,null,null,null,null,null,""]
[null,null,12,null,null,"grau",{"$f":"COUNTIF(Kugeln!$X$4:$X$52,CONCATENATE(\"(\",Ergebnismenge!C299,\", \",F315,\")\"))","v":0},null,null,null,null,null,null,{"$f":"IF(AND(SUM($G$108:G314)>0,G315>0),\", \",\"\")","v":""},"",null,null,null,null,null,null,""]
[null,null,13,null,null,"grau",{"$f":"COUNTIF(Kugeln!$X$4:$X$52,CONCATENATE(\"(\",Ergebnismenge!C300,\", \",F316,\")\"))","v":0},null,null,null,null,null,null,{"$f":"IF(AND(SUM($G$108:G315)>0,G316>0),\", \",\"\")","v":""},"",null,null,null,null,null,null,""]
[null,null,14,null,null,"grau",{"$f":"COUNTIF(Kugeln!$X$4:$X$52,CONCATENATE(\"(\",Ergebnismenge!C301,\", \",F317,\")\"))","v":0},null,null,null,null,null,null,{"$f":"IF(AND(SUM($G$108:G316)>0,G317>0),\", \",\"\")","v":""},"",null,null,null,null,null,null,""]
[null,null,15,null,null,"grau",{"$f":"COUNTIF(Kugeln!$X$4:$X$52,CONCATENATE(\"(\",Ergebnismenge!C302,\", \",F318,\")\"))","v":0},null,null,null,null,null,null,{"$f":"IF(AND(SUM($G$108:G317)>0,G318>0),\", \",\"\")","v":""},"",null,null,null,null,null,null,""]
[null,null,16,null,null,"grau",{"$f":"COUNTIF(Kugeln!$X$4:$X$52,CONCATENATE(\"(\",Ergebnismenge!C303,\", \",F319,\")\"))","v":0},null,null,null,null,null,null,{"$f":"IF(AND(SUM($G$108:G318)>0,G319>0),\", \",\"\")","v":""},"",null,null,null,null,null,null,""]
[null,null,17,null,null,"grau",{"$f":"COUNTIF(Kugeln!$X$4:$X$52,CONCATENATE(\"(\",Ergebnismenge!C304,\", \",F320,\")\"))","v":0},null,null,null,null,null,null,{"$f":"IF(AND(SUM($G$108:G319)>0,G320>0),\", \",\"\")","v":""},"",null,null,null,null,null,null,""]
[null,null,18,null,null,"grau",{"$f":"COUNTIF(Kugeln!$X$4:$X$52,CONCATENATE(\"(\",Ergebnismenge!C305,\", \",F321,\")\"))","v":0},null,null,null,null,null,null,{"$f":"IF(AND(SUM($G$108:G320)>0,G321>0),\", \",\"\")","v":""},"",null,null,null,null,null,null,""]
[null,null,19,null,null,"grau",{"$f":"COUNTIF(Kugeln!$X$4:$X$52,CONCATENATE(\"(\",Ergebnismenge!C306,\", \",F322,\")\"))","v":0},null,null,null,null,null,null,{"$f":"IF(AND(SUM($G$108:G321)>0,G322>0),\", \",\"\")","v":""},"",null,null,null,null,null,null,""]
[null,null,20,null,null,"grau",{"$f":"COUNTIF(Kugeln!$X$4:$X$52,CONCATENATE(\"(\",Ergebnismenge!C307,\", \",F323,\")\"))","v":0},null,null,null,null,null,null,{"$f":"IF(AND(SUM($G$108:G322)>0,G323>0),\", \",\"\")","v":""},"",null,null,null,null,null,null,""]
[null,null,21,null,null,"grau",{"$f":"COUNTIF(Kugeln!$X$4:$X$52,CONCATENATE(\"(\",Ergebnismenge!C308,\", \",F324,\")\"))","v":0},null,null,null,null,null,null,{"$f":"IF(AND(SUM($G$108:G323)>0,G324>0),\", \",\"\")","v":""},"",null,null,null,null,null,null,""]
[null,null,22,null,null,"grau",{"$f":"COUNTIF(Kugeln!$X$4:$X$52,CONCATENATE(\"(\",Ergebnismenge!C309,\", \",F325,\")\"))","v":0},null,null,null,null,null,null,{"$f":"IF(AND(SUM($G$108:G324)>0,G325>0),\", \",\"\")","v":""},"",null,null,null,null,null,null,""]
[null,null,23,null,null,"grau",{"$f":"COUNTIF(Kugeln!$X$4:$X$52,CONCATENATE(\"(\",Ergebnismenge!C310,\", \",F326,\")\"))","v":0},null,null,null,null,null,null,{"$f":"IF(AND(SUM($G$108:G325)>0,G326>0),\", \",\"\")","v":""},"",null,null,null,null,null,null,""]
[null,null,24,null,null,"grau",{"$f":"COUNTIF(Kugeln!$X$4:$X$52,CONCATENATE(\"(\",Ergebnismenge!C311,\", \",F327,\")\"))","v":0},null,null,null,null,null,null,{"$f":"IF(AND(SUM($G$108:G326)>0,G327>0),\", \",\"\")","v":""},"",null,null,null,null,null,null,""]
[null,null,25,null,null,"grau",{"$f":"COUNTIF(Kugeln!$X$4:$X$52,CONCATENATE(\"(\",Ergebnismenge!C312,\", \",F328,\")\"))","v":0},null,null,null,null,null,null,{"$f":"IF(AND(SUM($G$108:G327)>0,G328>0),\", \",\"\")","v":""},"",null,null,null,null,null,null,""]
[null,null,26,null,null,"grau",{"$f":"COUNTIF(Kugeln!$X$4:$X$52,CONCATENATE(\"(\",Ergebnismenge!C313,\", \",F329,\")\"))","v":0},null,null,null,null,null,null,{"$f":"IF(AND(SUM($G$108:G328)>0,G329>0),\", \",\"\")","v":""},"",null,null,null,null,null,null,""]
[null,null,27,null,null,"grau",{"$f":"COUNTIF(Kugeln!$X$4:$X$52,CONCATENATE(\"(\",Ergebnismenge!C314,\", \",F330,\")\"))","v":0},null,null,null,null,null,null,{"$f":"IF(AND(SUM($G$108:G329)>0,G330>0),\", \",\"\")","v":""},"",null,null,null,null,null,null,""]
[null,null,28,null,null,"grau",{"$f":"COUNTIF(Kugeln!$X$4:$X$52,CONCATENATE(\"(\",Ergebnismenge!C315,\", \",F331,\")\"))","v":0},null,null,null,null,null,null,{"$f":"IF(AND(SUM($G$108:G330)>0,G331>0),\", \",\"\")","v":""},"",null,null,null,null,null,null,""]
[null,null,29,null,null,"grau",{"$f":"COUNTIF(Kugeln!$X$4:$X$52,CONCATENATE(\"(\",Ergebnismenge!C316,\", \",F332,\")\"))","v":0},null,null,null,null,null,null,{"$f":"IF(AND(SUM($G$108:G331)>0,G332>0),\", \",\"\")","v":""},"",null,null,null,null,null,null,""]
[null,null,30,null,null,"grau",{"$f":"COUNTIF(Kugeln!$X$4:$X$52,CONCATENATE(\"(\",Ergebnismenge!C317,\", \",F333,\")\"))","v":0},null,null,null,null,null,null,{"$f":"IF(AND(SUM($G$108:G332)>0,G333>0),\", \",\"\")","v":""},"",null,null,null,null,null,null,""]
[null,null,31,null,null,"grau",{"$f":"COUNTIF(Kugeln!$X$4:$X$52,CONCATENATE(\"(\",Ergebnismenge!C318,\", \",F334,\")\"))","v":0},null,null,null,null,null,null,{"$f":"IF(AND(SUM($G$108:G333)>0,G334>0),\", \",\"\")","v":""},"",null,null,null,null,null,null,""]
[null,null,32,null,null,"grau",{"$f":"COUNTIF(Kugeln!$X$4:$X$52,CONCATENATE(\"(\",Ergebnismenge!C319,\", \",F335,\")\"))","v":0},null,null,null,null,null,null,{"$f":"IF(AND(SUM($G$108:G334)>0,G335>0),\", \",\"\")","v":""},"",null,null,null,null,null,null,""]
[null,null,33,null,null,"grau",{"$f":"COUNTIF(Kugeln!$X$4:$X$52,CONCATENATE(\"(\",Ergebnismenge!C320,\", \",F336,\")\"))","v":0},null,null,null,null,null,null,{"$f":"IF(AND(SUM($G$108:G335)>0,G336>0),\", \",\"\")","v":""},"",null,null,null,null,null,null,""]
[null,null,34,null,null,"grau",{"$f":"COUNTIF(Kugeln!$X$4:$X$52,CONCATENATE(\"(\",Ergebnismenge!C321,\", \",F337,\")\"))","v":0},null,null,null,null,null,null,{"$f":"IF(AND(SUM($G$108:G336)>0,G337>0),\", \",\"\")","v":""},"",null,null,null,null,null,null,""]
[null,null,35,null,null,"grau",{"$f":"COUNTIF(Kugeln!$X$4:$X$52,CONCATENATE(\"(\",Ergebnismenge!C322,\", \",F338,\")\"))","v":0},null,null,null,null,null,null,{"$f":"IF(AND(SUM($G$108:G337)>0,G338>0),\", \",\"\")","v":""},"",null,null,null,null,null,null,""]
[null,null,36,null,null,"grau",{"$f":"COUNTIF(Kugeln!$X$4:$X$52,CONCATENATE(\"(\",Ergebnismenge!C323,\", \",F339,\")\"))","v":0},null,null,null,null,null,null,{"$f":"IF(AND(SUM($G$108:G338)>0,G339>0),\", \",\"\")","v":""},"",null,null,null,null,null,null,""]
[null,null,37,null,null,"grau",{"$f":"COUNTIF(Kugeln!$X$4:$X$52,CONCATENATE(\"(\",Ergebnismenge!C324,\", \",F340,\")\"))","v":0},null,null,null,null,null,null,{"$f":"IF(AND(SUM($G$108:G339)>0,G340>0),\", \",\"\")","v":""},"",null,null,null,null,null,null,""]
[null,null,38,null,null,"grau",{"$f":"COUNTIF(Kugeln!$X$4:$X$52,CONCATENATE(\"(\",Ergebnismenge!C325,\", \",F341,\")\"))","v":0},null,null,null,null,null,null,{"$f":"IF(AND(SUM($G$108:G340)>0,G341>0),\", \",\"\")","v":""},"",null,null,null,null,null,null,""]
[null,null,39,null,null,"grau",{"$f":"COUNTIF(Kugeln!$X$4:$X$52,CONCATENATE(\"(\",Ergebnismenge!C326,\", \",F342,\")\"))","v":0},null,null,null,null,null,null,{"$f":"IF(AND(SUM($G$108:G341)>0,G342>0),\", \",\"\")","v":""},"",null,null,null,null,null,null,""]
[null,null,40,null,null,"grau",{"$f":"COUNTIF(Kugeln!$X$4:$X$52,CONCATENATE(\"(\",Ergebnismenge!C327,\", \",F343,\")\"))","v":0},null,null,null,null,null,null,{"$f":"IF(AND(SUM($G$108:G342)>0,G343>0),\", \",\"\")","v":""},"",null,null,null,null,null,null,""]
[null,null,41,null,null,"grau",{"$f":"COUNTIF(Kugeln!$X$4:$X$52,CONCATENATE(\"(\",Ergebnismenge!C328,\", \",F344,\")\"))","v":0},null,null,null,null,null,null,{"$f":"IF(AND(SUM($G$108:G343)>0,G344>0),\", \",\"\")","v":""},"",null,null,null,null,null,null,""]
[null,null,42,null,null,"grau",{"$f":"COUNTIF(Kugeln!$X$4:$X$52,CONCATENATE(\"(\",Ergebnismenge!C329,\", \",F345,\")\"))","v":0},null,null,null,null,null,null,{"$f":"IF(AND(SUM($G$108:G344)>0,G345>0),\", \",\"\")","v":""},"",null,null,null,null,null,null,""]
[null,null,43,null,null,"grau",{"$f":"COUNTIF(Kugeln!$X$4:$X$52,CONCATENATE(\"(\",Ergebnismenge!C330,\", \",F346,\")\"))","v":0},null,null,null,null,null,null,{"$f":"IF(AND(SUM($G$108:G345)>0,G346>0),\", \",\"\")","v":""},"",null,null,null,null,null,null,""]
[null,null,44,null,null,"grau",{"$f":"COUNTIF(Kugeln!$X$4:$X$52,CONCATENATE(\"(\",Ergebnismenge!C331,\", \",F347,\")\"))","v":0},null,null,null,null,null,null,{"$f":"IF(AND(SUM($G$108:G346)>0,G347>0),\", \",\"\")","v":""},"",null,null,null,null,null,null,""]
[null,null,45,null,null,"grau",{"$f":"COUNTIF(Kugeln!$X$4:$X$52,CONCATENATE(\"(\",Ergebnismenge!C332,\", \",F348,\")\"))","v":0},null,null,null,null,null,null,{"$f":"IF(AND(SUM($G$108:G347)>0,G348>0),\", \",\"\")","v":""},"",null,null,null,null,null,null,""]
[null,null,46,null,null,"grau",{"$f":"COUNTIF(Kugeln!$X$4:$X$52,CONCATENATE(\"(\",Ergebnismenge!C333,\", \",F349,\")\"))","v":0},null,null,null,null,null,null,{"$f":"IF(AND(SUM($G$108:G348)>0,G349>0),\", \",\"\")","v":""},"",null,null,null,null,null,null,""]
[null,null,47,null,null,"grau",{"$f":"COUNTIF(Kugeln!$X$4:$X$52,CONCATENATE(\"(\",Ergebnismenge!C334,\", \",F350,\")\"))","v":0},null,null,null,null,null,null,{"$f":"IF(AND(SUM($G$108:G349)>0,G350>0),\", \",\"\")","v":""},"",null,null,null,null,null,null,""]
[null,null,48,null,null,"grau",{"$f":"COUNTIF(Kugeln!$X$4:$X$52,CONCATENATE(\"(\",Ergebnismenge!C335,\", \",F351,\")\"))","v":0},null,null,null,null,null,null,{"$f":"IF(AND(SUM($G$108:G350)>0,G351>0),\", \",\"\")","v":""},"",null,null,null,null,null,null,""]
[null,null,49,null,null,"grau",{"$f":"COUNTIF(Kugeln!$X$4:$X$52,CONCATENATE(\"(\",Ergebnismenge!C336,\", \",F352,\")\"))","v":0},null,null,null,null,null,null,{"$f":"IF(AND(SUM($G$108:G351)>0,G352>0),\", \",\"\")","v":""},"",null,null,null,null,null,null,""]
[]
[null,null,"Anzahl",null,null,null,{"$f":"SUM(G108:G352)","v":49}]
[]
[null,null,"|Ω| =",null,null,null,{"$f":"COUNTIF(G108:G352,\">0\")","v":31}]